{"text_format":"1","workbook":"xlsx","n_sheets":27,"sheets":["bianco","Autenticazione","inizio","Dati","fabb_ACS","fabb_risc","UNI8477","riepilogo","relazione","relazione22","Dettaglio mesi","ammortamento","cti_show","relazione_amm","cashflow","incentivi","cti","fc","Tabelle","TabellaCD","Tabelle2","Tabelle3","Tabelle5","bollitore","Tabelle6","CT20","Tabelle UNI"],"not_rendered":{"charts":4,"images":22,"macros":1,"external_links":0,"defined_names":204,"comments":4,"pivot_tables":0},"unopened":[],"bounds":{"document_bytes":16777216,"sheet_cells":100000,"rows_first":2000,"rows_last":500,"rows_between":2000,"halvings":0,"cell_chars":16384,"cell_head_chars":4096},"cells_cut":0,"cells_raw":0,"read":"whole","date_system":"1900"}

{"sheet":"bianco","index":0,"n_rows":0,"n_cols":0,"rows_kept":0,"cut":false,"hidden":false,"merged":[]}

{"sheet":"Autenticazione","index":1,"n_rows":47,"n_cols":12,"rows_kept":47,"cut":false,"hidden":false,"merged":[[16,6,16,7],[5,1,5,7],[11,3,11,4],[11,6,11,7],[12,3,12,4],[12,6,12,7],[8,3,8,7],[9,3,9,4],[6,6,6,7],[9,6,9,7],[10,3,10,7],[14,2,14,7],[13,3,13,7]]}
[]
[null,"Richiesta di licenza d'uso per il programma ParaSol FC",null,null,null,null,null,null,null,null,"Password aspettata"]
[null,null,null,null,null,null,null,null,null,null,{"$f":"100000+ROUND(+SQRT(codice_utente),0)","v":121195}]
[null,"Inviare via mail a info@paradigmaitalia.it",null,null,null,null,null,null,null,null,"Giusta?",{"$f":"IF(OR(passord_OK=password,password=\"0321Para\"),\"OK\",\"KO\")","v":"OK"}]
[]
[]
[null,"Riservato all'ufficio Paradigma.",null,"Il vostro codice di abilitazione è:",null,null,"0321Para"]
[]
[null,"Intestatario:","Ditta:*"]
[null,null,"Cognome:*",null,null,"Nome:*"]
[null,null,"Indirizzo:*"]
[null,null,"Città:*",null,null,"Provincia:*"]
[null,null,"Telefono:*",null,null,"Fax:"]
[null,null,"Email:"]
[null,null,"* i dati sono obbligatori"]
[null,"Agenzia Paradigma",null,"Partner Paradigma",null,null,"Altro"]
[null,null,null,null,null,null,null,null,null,true,1]
[null,null,null,null,null,null,null,null,null,false,2]
[null,"Numero di serie:",449245632,null,null,null,null,null,null,false,3]
[null,null,null,null,null,null,null,null,null,{"$f":"+IF(_age=TRUE,1,IF(_pp=TRUE,2,3))","v":1}]
[null,"Licenza d'uso:"]
[]
[]
[]
[]
[]
[]
[]
[]
[]
[]
[]
[]
[]
[]
[]
[]
[]
[]
[]
[]
[null,"Autorizzo il trattamento dei miei dati."]
[]
[]
[]
[null,"Data:",null,null,"Firma:"]
[null,{"$f":"+NOW()","v":"2018-01-29T15:57:32.520"}]

{"sheet":"inizio","index":2,"n_rows":20,"n_cols":6,"rows_kept":20,"cut":false,"hidden":false,"merged":[]}
[]
[]
[]
[]
[]
[]
[]
[null,null,"Dati generali impianto",null,null,"Energia solare mensile incidente sui collettori"]
[null,null,"Oggetto, committente, località, dati collettori (tipo, superficie, inclinazione)",null,null,"Energia raggiante ricevuta (per metro2) in accordo alle norme UNI 8477 parte I"]
[null,null,{"$f":"\"Fabbisogno acqua calda sanitaria\"","v":"Fabbisogno acqua calda sanitaria"},{"$f":"IF(+Tabelle!C28=\"SI\",+Tabelle!C28,\"\")","v":"SI"},null,"Risultati del calcolo - copertura solare"]
[null,null,"Stima del fabbisogno energetico per l'aqua calda sanitaria.",null,null,"Riepilogo dei fabbisogni energetici, copertura solare"]
[null,null,{"$f":"\"Fabbisogno per riscaldamento\"","v":"Fabbisogno per riscaldamento"},{"$f":"IF(+Tabelle!C29=\"SI\",+Tabelle!C29,\"\")","v":""},null,"Relazione tecnica di riepilogo"]
[null,null,"Stima del fabbisogno per integrazione riscaldamento - Periodo riscaldamento - Gradi giorno - Potenza caldaia",null,null,"Relazione con i principali dati di input e di output"]
[null,null,null,{"$f":"IF(+Tabelle!C31=\"SI\",+Tabelle!C31,\"\")","v":""},null,"Bilancio economico impianto"]
[null,null,null,null,null,"Risparmio annuo sulla bolletta grazie all'impianto solare"]
[]
[]
[]
[]
[null," "]

{"sheet":"Dati","index":3,"n_rows":18,"n_cols":18,"rows_kept":18,"cut":false,"hidden":false,"merged":[[4,2,4,19],[5,4,5,9],[7,4,7,9],[15,5,15,6],[18,4,18,7],[9,2,9,19],[14,2,14,19],[13,2,13,19],[17,3,17,6],[16,2,16,7]]}
[]
[]
[]
[]
[null,null,"Dati impianto"]
[null,null,"Committente:",null,null,null,null,null,null,null,null,"Provincia:",null,{"$f":"+Tabelle2!D2","v":"Brescia"},null,null,null,{"$f":"+\"Lat. = \"&Tabelle2!F5&\"°\"","v":"Lat. = 45°"}]
[]
[null,null,"Riferimento:"]
[]
[null,null,"Caratteristiche deI COLLETTORI"]
[null,null,"Tipo:",null,{"$f":"Tabelle!B14","v":"AQUA PLASMA"},null,null,null,null,null,null,"Sup.apertura:",null,{"$f":"+Tabelle2!J7/10","v":8},"m2"]
[]
[null,null,"Inclinazione:",null,{"$f":"+Tabelle2!J6","v":30},"sull'orizzontale",null,null,null,null,null,"Azimut:",null,{"$f":"+-90+Tabelle2!J5","v":-5},"orientamento da sud"]
[null,null,{"$f":"+Tabelle2!H10","v":""}]
[null,null,"Impianto solare"]
[null,null,"Accumulo solare:",null,null,{"$f":"+bollitore!I58","v":500},null,"litri",null,null,null,"Tecnologia Aqua:",null,null,null,null,{"$f":"IF(aquasys=FALSE,\"NO\",\"SI\")","v":"SI"}]
[]
[null,null,null,{"$f":"+bollitore!K58","v":"Aqua Expresso III 500"},null,null,null,null,null,null,null,"Solare come preriscaldo:",null,null,null,null,{"$f":"IF(preriscaldo=FALSE,\"NO\",\"SI\")","v":"NO"}]

{"sheet":"fabb_ACS","index":4,"n_rows":24,"n_cols":15,"rows_kept":24,"cut":false,"hidden":false,"merged":[[19,6,19,7],[20,6,20,7],[11,2,11,13],[16,6,16,7],[17,6,17,7],[18,6,18,7]]}
[]
[]
[]
[]
[null,null,"Consumi:",{"$f":"IF(Tabelle5!H28=\"SI\",\"Altro utilizzo\",+Tabelle5!B28)","v":"Dormitori, residence, B&B"},null,null,null,null,"Temperature:",null,"utilizzo:",40,null,"Valore UNI:\n40°C",45]
[null,null,null,{"$f":"IF(D5=\"altro utilizzo\",\"\",+Tabelle5!D28)","v":40},{"$f":"+Tabelle5!E28","v":"litri/G per letto"},null,null,null,null,null,"ingresso:",{"$f":"+ROUND(Tabelle5!C39,0)","v":13},"Valore UNI non modificabile",null,12]
[null,null,null,{"$f":"IF(D5=\"altro utilizzo\",\"\",+Tabelle5!G28)","v":25},{"$f":"+Tabelle5!J28","v":"letti"},null,null,null,null,null,null,null,null,null,8]
[null,null,null,{"$f":"+Tabelle5!H34","v":1000},"litri / giorno (Vw)",null,null,null,"Profilo utilizzo:",null,"annuale",{"$f":"+Tabelle5!B70","v":"sempre 100%"}]
[null,null,null,{"$f":"+Tabelle5!E40","v":30.862060185185182},"kWh/giorno (inverno)"]
[null,null,null,null,null,null,null,null,"Ricircolo:"]
[]
[null,null,"Periodo d'utilizzo"]
[null,null,"gen","feb","mar","apr","mag","giu","lug","ago","sett","ott","nov","dic"]
[null,null,100,100,100,100,100,100,100,100,100,100,100,100]
[null,null,{"$f":"+Tabelle5!E44","v":956.72386574074062},{"$f":"+Tabelle5!E45","v":864.13768518518509},{"$f":"+Tabelle5!E46","v":956.72386574074062},{"$f":"+Tabelle5!E47","v":925.86180555555552},{"$f":"+Tabelle5!E48","v":956.72386574074062},{"$f":"+Tabelle5!E49","v":925.86180555555552},{"$f":"+Tabelle5!E50","v":956.72386574074062},{"$f":"+Tabelle5!E51","v":956.72386574074062},{"$f":"+Tabelle5!E52","v":925.86180555555552},{"$f":"+Tabelle5!E53","v":956.72386574074062},{"$f":"+Tabelle5!E54","v":925.86180555555552},{"$f":"+Tabelle5!E55","v":956.72386574074062}]
[]
[null,null,"Fabbisogno utile per ACS",null,null,"Qh,w:",{"$f":"SUM(C15:N15)","v":11264.651967592592},null,"/anno"]
[null,null,"Fabbisogno per distribuzione",null,null,"Ql,w,d:",{"$f":"+cti!F31+cti!H31","v":1159.9571574074075},null,"/anno"]
[null,null,"Fabbisogno erogazione",null,null,"Ql,w,er:",{"$f":"+cti!G31","v":0},null,"/anno"]
[null,null,"Fabbisogno stoccaggio",null,null,"Ql,w,s:",{"$f":"+cti!I31","v":637.72800000000007},null,"/anno"]
[null,null,"Totale fabbisogno sanitario",null,null,"Q,w,gn,out:",{"$f":"+G20+G19+G18+G17","v":13062.337125},null,"/anno"]
[]
[]
[null,null,{"$f":"IF((D23+G23+J23+M23)>D8,\"Attenzione: il totale supera il consumo giornaliero. Ricontrollare le percentuali!\",\"\")","v":""}]

{"sheet":"fabb_risc","index":5,"n_rows":33,"n_cols":15,"rows_kept":33,"cut":false,"hidden":false,"merged":[[17,4,17,5]]}
[]
[]
[]
[]
[null,null,"Dati di calcolo"]
[null,null,"Temperature circuito riscald:",null,null,{"$f":"+TabellaCD!D8","v":50},{"$f":"+TabellaCD!C8","v":35}]
[null,null,"Raffrescamento solare estivo",null,null,{"$f":"+TabellaCD!I8","v":80},{"$f":"+TabellaCD!H8","v":70},null,"(inserire i valori energetici nei mesi di GIU-LUG-AGO)"]
[]
[null,null,"Inserire i fabbisogni per il riscaldamento / raffrescamento (input libero dell'utente):"]
[null,null,null,"gen","feb","mar","apr","mag","giu","lug","ago","set","ott","nov","dic"]
[null,null,"kWh / mese",845.65462753950339,722.23476297968398,489.10835214446951,297.12189616252823,105.13544018058693,0,0,0,4.5711060948081919,274.26636568848755,557.67494356659142,754.23250564334091]
[]
[null,null,"Stima del fabbisogno:"]
[]
[null,null,"Superficie riscaldata",null,90,"m2",null,null,"Temp.min. progetto",null,{"$f":"VLOOKUP(Tabelle2!localitàscelta,'Tabelle UNI'!Z5:AH105,9,FALSE)","v":-7}]
[null,null,"Fabbisogno EPH",null,45,"kWh/m2 anno",null,null,"Temp. media invern.",null,{"$f":"IF(K17<138,AVERAGE(D27,E27,N27,O27),IF(K17<184,AVERAGE(D27,E27,F27,O27,N27,M27),AVERAGE(D27,E27,F27,O27,N27,M27,G27)))","v":7.6857142857142851}]
[null,null,null,null,null,null,null,null,"Giorni riscald. / zona",null,{"$f":"VLOOKUP(Tabelle2!localitàscelta,'Tabelle UNI'!BK5:BO105,4,FALSE)&\" / \"&VLOOKUP(Tabelle2!localitàscelta,'Tabelle UNI'!BK5:BO105,3,FALSE)","v":"183 / E"}]
[null,null,null,null,null,null,null,null,"Gradi giorno",null,{"$f":"VLOOKUP(Tabelle2!localitàscelta,'Tabelle UNI'!BK5:BO105,5,FALSE)","v":2410}]
[]
[]
[]
[]
[]
[]
[null,null,"I fabbisogni stimati mensili risultano i seguenti:"]
[null,null,null,"gen","feb","mar","apr","mag","giu","lug","ago","set","ott","nov","dic"]
[null,null,"T.media esterna",{"$f":"VLOOKUP(Tabelle2!localitàscelta,'Tabelle UNI'!A5:P105,5,FALSE)","v":1.5},{"$f":"VLOOKUP(Tabelle2!localitàscelta,'Tabelle UNI'!A5:P105,6,FALSE)","v":4.2},{"$f":"VLOOKUP(Tabelle2!localitàscelta,'Tabelle UNI'!A5:P105,7,FALSE)","v":9.3000000000000007},{"$f":"VLOOKUP(Tabelle2!localitàscelta,'Tabelle UNI'!A5:P105,8,FALSE)","v":13.5},{"$f":"VLOOKUP(Tabelle2!localitàscelta,'Tabelle UNI'!A5:P105,9,FALSE)","v":17.7},{"$f":"VLOOKUP(Tabelle2!localitàscelta,'Tabelle UNI'!A5:P105,10,FALSE)","v":22},{"$f":"VLOOKUP(Tabelle2!localitàscelta,'Tabelle UNI'!A5:P105,11,FALSE)","v":24.4},{"$f":"VLOOKUP(Tabelle2!localitàscelta,'Tabelle UNI'!A5:P105,12,FALSE)","v":23.7},{"$f":"VLOOKUP(Tabelle2!localitàscelta,'Tabelle UNI'!A5:P105,13,FALSE)","v":19.899999999999999},{"$f":"VLOOKUP(Tabelle2!localitàscelta,'Tabelle UNI'!A5:P105,14,FALSE)","v":14},{"$f":"VLOOKUP(Tabelle2!localitàscelta,'Tabelle UNI'!A5:P105,15,FALSE)","v":7.8},{"$f":"VLOOKUP(Tabelle2!localitàscelta,'Tabelle UNI'!A5:P105,16,FALSE)","v":3.5}]
[null,null,"DT medio",{"$f":"20-D27","v":18.5},{"$f":"20-E27","v":15.8},10.7,6.5,2.3000000000000007,-2,-4.3999999999999986,-3.6999999999999993,0.10000000000000142,6,12.2,16.5]
[null,null,"DT medio",{"$f":"IF(D28<0,0,D28)","v":18.5},{"$f":"IF(E28<0,0,E28)","v":15.8},10.7,6.5,2.3000000000000007,0,0,0,0.10000000000000142,6,12.2,16.5]
[null,null,"kWh/m2 mese",{"$f":"$E$16/SUM($D$29:$O$29)*D29","v":9.3961625282167045},8.0248306997742667,5.4345372460496613,3.3013544018058689,1.168171557562077,0,0,0,5.0790067720091016E-2,3.0474040632054176,6.1963882618510153,8.3803611738148991]
[null,null,"kWh / giorno",{"$f":"+D30*24","v":225.50790067720089},{"$f":"+E30*24","v":192.5959367945824},130.42889390519187,79.232505643340858,28.036117381489849,0,0,0,1.2189616252821844,73.137697516930018,148.71331828442436,201.12866817155759]
[null,null,"gg",31,28,31,30,31,30,31,31,30,31,30,31]
[null,null,"kWh / mese",{"$f":"+D30*sup_risc","v":845.65462753950339},722.23476297968398,489.10835214446951,297.12189616252823,105.13544018058693,0,0,0,4.5711060948081919,274.26636568848755,557.67494356659142,754.23250564334091]

{"sheet":"UNI8477","index":6,"n_rows":28,"n_cols":17,"rows_kept":28,"cut":false,"hidden":false,"merged":[[4,15,6,15],[4,3,6,3],[2,5,2,15],[4,11,6,11],[4,12,6,12],[4,13,6,13],[4,14,6,14],[4,7,6,7],[4,10,6,10],[4,4,6,4],[4,8,6,8],[4,9,6,9],[4,5,6,5],[4,6,6,6],[26,2,26,3],[27,2,27,3],[24,4,24,5],[25,4,25,5],[26,4,26,5],[27,4,27,5],[24,2,24,3],[25,2,25,3]]}
[]
[]
[]
[]
[null,null,null,"Un.Mis","Gennaio","Febbraio","Marzo","Aprile","Maggio","Giugno","Luglio","Agosto","Settembre","Ottobre","Novembre","Dicembre"]
[]
[]
[null,null,"Hh","MJ/m2g",{"$f":"'Dettaglio mesi'!E6","v":4.5999999999999996},{"$f":"'Dettaglio mesi'!F6","v":7.8},{"$f":"'Dettaglio mesi'!G6","v":12.4},{"$f":"'Dettaglio mesi'!H6","v":16.100000000000001},{"$f":"'Dettaglio mesi'!I6","v":20.399999999999999},{"$f":"'Dettaglio mesi'!J6","v":22.5},{"$f":"'Dettaglio mesi'!K6","v":24.4},{"$f":"'Dettaglio mesi'!L6","v":20.2},{"$f":"'Dettaglio mesi'!M6","v":14.700000000000001},{"$f":"'Dettaglio mesi'!N6","v":9.1999999999999993},{"$f":"'Dettaglio mesi'!O6","v":5.3000000000000007},{"$f":"'Dettaglio mesi'!P6","v":4.3000000000000007}]
[null,null,"r","-",{"$f":"'Dettaglio mesi'!E4","v":0.22},{"$f":"'Dettaglio mesi'!F4","v":0.22},{"$f":"'Dettaglio mesi'!G4","v":0.22},{"$f":"'Dettaglio mesi'!H4","v":0.22},{"$f":"'Dettaglio mesi'!I4","v":0.22},{"$f":"'Dettaglio mesi'!J4","v":0.22},{"$f":"'Dettaglio mesi'!K4","v":0.22},{"$f":"'Dettaglio mesi'!L4","v":0.22},{"$f":"'Dettaglio mesi'!M4","v":0.22},{"$f":"'Dettaglio mesi'!N4","v":0.22},{"$f":"'Dettaglio mesi'!O4","v":0.22},{"$f":"'Dettaglio mesi'!P4","v":0.22}]
[null,null,"d","°",{"$f":"'Dettaglio mesi'!E7","v":-20.916962574476418},{"$f":"'Dettaglio mesi'!F7","v":-12.954608093780696},{"$f":"'Dettaglio mesi'!G7","v":-2.4177348051423611},{"$f":"'Dettaglio mesi'!H7","v":9.4148933468800529},{"$f":"'Dettaglio mesi'!I7","v":18.791917517696167},{"$f":"'Dettaglio mesi'!J7","v":23.085911002836561},{"$f":"'Dettaglio mesi'!K7","v":21.183693564513842},{"$f":"'Dettaglio mesi'!L7","v":13.454959682356431},{"$f":"'Dettaglio mesi'!M7","v":2.2168867832133041},{"$f":"'Dettaglio mesi'!N7","v":-9.5993972342263003},{"$f":"'Dettaglio mesi'!O7","v":-18.911954741226136},{"$f":"'Dettaglio mesi'!P7","v":-23.049627643930577}]
[null,null,"ws","°",{"$f":"'Dettaglio mesi'!E9","v":67.529845549502454},{"$f":"'Dettaglio mesi'!F9","v":76.700933650600049},{"$f":"'Dettaglio mesi'!G9","v":87.580109777979487},{"$f":"'Dettaglio mesi'!H9","v":99.544640831539482},{"$f":"'Dettaglio mesi'!I9","v":109.89334682923106},{"$f":"'Dettaglio mesi'!J9","v":115.22952752977012},{"$f":"'Dettaglio mesi'!K9","v":112.8019558845571},{"$f":"'Dettaglio mesi'!L9","v":103.84213175195883},{"$f":"'Dettaglio mesi'!M9","v":92.218548065018638},{"$f":"'Dettaglio mesi'!N9","v":80.262963105681067},{"$f":"'Dettaglio mesi'!O9","v":69.964051949995408},{"$f":"'Dettaglio mesi'!P9","v":64.817847273425684}]
[null,null,"w'","°",{"$f":"'Dettaglio mesi'!E39","v":-67.529845549502454},{"$f":"'Dettaglio mesi'!F39","v":-76.700933650600049},{"$f":"'Dettaglio mesi'!G39","v":-87.580109777979487},{"$f":"'Dettaglio mesi'!H39","v":-95.147462815522729},{"$f":"'Dettaglio mesi'!I39","v":-97.847213653566683},{"$f":"'Dettaglio mesi'!J39","v":-99.18165845206758},{"$f":"'Dettaglio mesi'!K39","v":-98.583515036118712},{"$f":"'Dettaglio mesi'!L39","v":-96.285644109042153},{"$f":"'Dettaglio mesi'!M39","v":-92.221267905707407},{"$f":"'Dettaglio mesi'!N39","v":-80.265330335239923},{"$f":"'Dettaglio mesi'!O39","v":-69.9661154294064},{"$f":"'Dettaglio mesi'!P39","v":-64.819758973642948}]
[null,null,"w''","°",{"$f":"'Dettaglio mesi'!E40","v":67.531837235833294},{"$f":"'Dettaglio mesi'!F40","v":76.703195823715831},{"$f":"'Dettaglio mesi'!G40","v":86.763963397497079},{"$f":"'Dettaglio mesi'!H40","v":89.976610259619633},{"$f":"'Dettaglio mesi'!I40","v":92.676440722558269},{"$f":"'Dettaglio mesi'!J40","v":94.010924878404694},{"$f":"'Dettaglio mesi'!K40","v":93.409856255803831},{"$f":"'Dettaglio mesi'!L40","v":91.111985328727272},{"$f":"'Dettaglio mesi'!M40","v":88.013476072265007},{"$f":"'Dettaglio mesi'!N40","v":80.265330335239923},{"$f":"'Dettaglio mesi'!O40","v":69.9661154294064},{"$f":"'Dettaglio mesi'!P40","v":64.819758973642948}]
[null,null,"KT","-",{"$f":"'Dettaglio mesi'!E28","v":0.38307947500663209},{"$f":"'Dettaglio mesi'!F28","v":0.44708073323209285},{"$f":"'Dettaglio mesi'!G28","v":0.50016303984412458},{"$f":"'Dettaglio mesi'!H28","v":0.49055842394522142},{"$f":"'Dettaglio mesi'!I28","v":0.52599420819151343},{"$f":"'Dettaglio mesi'!J28","v":0.54447798854462515},{"$f":"'Dettaglio mesi'!K28","v":0.60970450025900014},{"$f":"'Dettaglio mesi'!L28","v":0.57547326564472312},{"$f":"'Dettaglio mesi'!M28","v":0.53138322626812706},{"$f":"'Dettaglio mesi'!N28","v":0.46990112604903567},{"$f":"'Dettaglio mesi'!O28","v":0.39949832960962245},{"$f":"'Dettaglio mesi'!P28","v":0.40672049130211546}]
[null,null,"R","-",{"$f":"'Dettaglio mesi'!E30","v":1.6070975162018766},{"$f":"'Dettaglio mesi'!F30","v":1.4396330464469711},{"$f":"'Dettaglio mesi'!G30","v":1.2461251270956057},{"$f":"'Dettaglio mesi'!H30","v":1.073214859003732},{"$f":"'Dettaglio mesi'!I30","v":0.97941042964191449},{"$f":"'Dettaglio mesi'!J30","v":0.93947135241509006},{"$f":"'Dettaglio mesi'!K30","v":0.95807487863782881},{"$f":"'Dettaglio mesi'!L30","v":1.0410783085169535},{"$f":"'Dettaglio mesi'!M30","v":1.1845980702240546},{"$f":"'Dettaglio mesi'!N30","v":1.3777187190962752},{"$f":"'Dettaglio mesi'!O30","v":1.5747987187593042},{"$f":"'Dettaglio mesi'!P30","v":1.7474938110820004}]
[null,null,"H","MJ/m2g",{"$f":"'Dettaglio mesi'!E31","v":7.3926485745286321},{"$f":"'Dettaglio mesi'!F31","v":11.229137762286374},{"$f":"'Dettaglio mesi'!G31","v":15.451951575985511},{"$f":"'Dettaglio mesi'!H31","v":17.278759229960087},{"$f":"'Dettaglio mesi'!I31","v":19.979972764695056},{"$f":"'Dettaglio mesi'!J31","v":21.138105429339525},{"$f":"'Dettaglio mesi'!K31","v":23.377027038763021},{"$f":"'Dettaglio mesi'!L31","v":21.02978183204246},{"$f":"'Dettaglio mesi'!M31","v":17.413591632293603},{"$f":"'Dettaglio mesi'!N31","v":12.675012215685731},{"$f":"'Dettaglio mesi'!O31","v":8.3464332094243137},{"$f":"'Dettaglio mesi'!P31","v":7.5142233876526028}]
[null,null,"Htot","MJ/m2",{"$f":"'Dettaglio mesi'!E33","v":229.17210581038759},{"$f":"'Dettaglio mesi'!F33","v":314.41585734401849},{"$f":"'Dettaglio mesi'!G33","v":479.01049885555085},{"$f":"'Dettaglio mesi'!H33","v":518.36277689880262},{"$f":"'Dettaglio mesi'!I33","v":619.37915570554674},{"$f":"'Dettaglio mesi'!J33","v":634.14316288018574},{"$f":"'Dettaglio mesi'!K33","v":724.68783820165368},{"$f":"'Dettaglio mesi'!L33","v":651.92323679331628},{"$f":"'Dettaglio mesi'!M33","v":522.40774896880805},{"$f":"'Dettaglio mesi'!N33","v":392.92537868625766},{"$f":"'Dettaglio mesi'!O33","v":250.3929962827294},{"$f":"'Dettaglio mesi'!P33","v":232.94092501723068},{"$f":"SUM(E17:P17)","v":5569.7616814444873}]
[null,null,null,"kWh/m2",{"$f":"E17*1000000/3600000","v":63.658918280663215},{"$f":"F17*1000000/3600000","v":87.337738151116255},133.05847190431967,143.98966024966739,172.04976547376299,176.15087857782936,201.30217727823714,181.08978799814341,145.11326360244669,109.14593852396047,69.553610078535939,64.705812504786309,{"$f":"SUM(E18:P18)","v":1547.156022623469}]
[]
[null,null,"Tm","°",{"$f":"'Dettaglio mesi'!E37","v":1.5},{"$f":"'Dettaglio mesi'!F37","v":4.2},{"$f":"'Dettaglio mesi'!G37","v":9.3000000000000007},{"$f":"'Dettaglio mesi'!H37","v":13.5},{"$f":"'Dettaglio mesi'!I37","v":17.7},{"$f":"'Dettaglio mesi'!J37","v":22},{"$f":"'Dettaglio mesi'!K37","v":24.4},{"$f":"'Dettaglio mesi'!L37","v":23.7},{"$f":"'Dettaglio mesi'!M37","v":19.899999999999999},{"$f":"'Dettaglio mesi'!N37","v":14},{"$f":"'Dettaglio mesi'!O37","v":7.8},{"$f":"'Dettaglio mesi'!P37","v":3.5}]
[]
[null,null,"Il sole sorge:*",null,{"$f":"TRUNC('Dettaglio mesi'!E44)&\"h \"&(TRUNC(('Dettaglio mesi'!E44-TRUNC('Dettaglio mesi'!E44))*60)&\"m\")","v":"7h 29m"},{"$f":"TRUNC('Dettaglio mesi'!F44)&\"h \"&(TRUNC(('Dettaglio mesi'!F44-TRUNC('Dettaglio mesi'!F44))*60)&\"m\")","v":"6h 53m"},{"$f":"TRUNC('Dettaglio mesi'!G44)&\"h \"&(TRUNC(('Dettaglio mesi'!G44-TRUNC('Dettaglio mesi'!G44))*60)&\"m\")","v":"6h 9m"},{"$f":"TRUNC('Dettaglio mesi'!H44)&\"h \"&(TRUNC(('Dettaglio mesi'!H44-TRUNC('Dettaglio mesi'!H44))*60)&\"m\")","v":"5h 39m"},{"$f":"TRUNC('Dettaglio mesi'!I44)&\"h \"&(TRUNC(('Dettaglio mesi'!I44-TRUNC('Dettaglio mesi'!I44))*60)&\"m\")","v":"5h 28m"},{"$f":"TRUNC('Dettaglio mesi'!J44)&\"h \"&(TRUNC(('Dettaglio mesi'!J44-TRUNC('Dettaglio mesi'!J44))*60)&\"m\")","v":"5h 23m"},{"$f":"TRUNC('Dettaglio mesi'!K44)&\"h \"&(TRUNC(('Dettaglio mesi'!K44-TRUNC('Dettaglio mesi'!K44))*60)&\"m\")","v":"5h 25m"},{"$f":"TRUNC('Dettaglio mesi'!L44)&\"h \"&(TRUNC(('Dettaglio mesi'!L44-TRUNC('Dettaglio mesi'!L44))*60)&\"m\")","v":"5h 34m"},{"$f":"TRUNC('Dettaglio mesi'!M44)&\"h \"&(TRUNC(('Dettaglio mesi'!M44-TRUNC('Dettaglio mesi'!M44))*60)&\"m\")","v":"5h 51m"},{"$f":"TRUNC('Dettaglio mesi'!N44)&\"h \"&(TRUNC(('Dettaglio mesi'!N44-TRUNC('Dettaglio mesi'!N44))*60)&\"m\")","v":"6h 38m"},{"$f":"TRUNC('Dettaglio mesi'!O44)&\"h \"&(TRUNC(('Dettaglio mesi'!O44-TRUNC('Dettaglio mesi'!O44))*60)&\"m\")","v":"7h 20m"},{"$f":"TRUNC('Dettaglio mesi'!P44)&\"h \"&(TRUNC(('Dettaglio mesi'!P44-TRUNC('Dettaglio mesi'!P44))*60)&\"m\")","v":"7h 40m"}]
[null,null,"Il sole tramonta:*",null,{"$f":"TRUNC('Dettaglio mesi'!E45)&\"h \"&(TRUNC(('Dettaglio mesi'!E45-TRUNC('Dettaglio mesi'!E45))*60)&\"m\")","v":"16h 30m"},{"$f":"TRUNC('Dettaglio mesi'!F45)&\"h \"&(TRUNC(('Dettaglio mesi'!F45-TRUNC('Dettaglio mesi'!F45))*60)&\"m\")","v":"17h 6m"},{"$f":"TRUNC('Dettaglio mesi'!G45)&\"h \"&(TRUNC(('Dettaglio mesi'!G45-TRUNC('Dettaglio mesi'!G45))*60)&\"m\")","v":"17h 47m"},{"$f":"TRUNC('Dettaglio mesi'!H45)&\"h \"&(TRUNC(('Dettaglio mesi'!H45-TRUNC('Dettaglio mesi'!H45))*60)&\"m\")","v":"17h 59m"},{"$f":"TRUNC('Dettaglio mesi'!I45)&\"h \"&(TRUNC(('Dettaglio mesi'!I45-TRUNC('Dettaglio mesi'!I45))*60)&\"m\")","v":"18h 10m"},{"$f":"TRUNC('Dettaglio mesi'!J45)&\"h \"&(TRUNC(('Dettaglio mesi'!J45-TRUNC('Dettaglio mesi'!J45))*60)&\"m\")","v":"18h 16m"},{"$f":"TRUNC('Dettaglio mesi'!K45)&\"h \"&(TRUNC(('Dettaglio mesi'!K45-TRUNC('Dettaglio mesi'!K45))*60)&\"m\")","v":"18h 13m"},{"$f":"TRUNC('Dettaglio mesi'!L45)&\"h \"&(TRUNC(('Dettaglio mesi'!L45-TRUNC('Dettaglio mesi'!L45))*60)&\"m\")","v":"18h 4m"},{"$f":"TRUNC('Dettaglio mesi'!M45)&\"h \"&(TRUNC(('Dettaglio mesi'!M45-TRUNC('Dettaglio mesi'!M45))*60)&\"m\")","v":"17h 52m"},{"$f":"TRUNC('Dettaglio mesi'!N45)&\"h \"&(TRUNC(('Dettaglio mesi'!N45-TRUNC('Dettaglio mesi'!N45))*60)&\"m\")","v":"17h 21m"},{"$f":"TRUNC('Dettaglio mesi'!O45)&\"h \"&(TRUNC(('Dettaglio mesi'!O45-TRUNC('Dettaglio mesi'!O45))*60)&\"m\")","v":"16h 39m"},{"$f":"TRUNC('Dettaglio mesi'!P45)&\"h \"&(TRUNC(('Dettaglio mesi'!P45-TRUNC('Dettaglio mesi'!P45))*60)&\"m\")","v":"16h 19m"}]
[null,null,"* sul collettore"]
[null,null,"Località",null,"Inclinazione",null,null,"Hh","Radiazione media globale al suolo sul piano orizzontale secondo UNI 10349"]
[null,null,{"$f":"Dati!N6","v":"Brescia"},null,{"$f":"Dati!E13","v":30},null,null,"H","Irraggiamento medio giornaliero sulla superficie considerata"]
[null,null,"Latitudine",null,"Azimut",null,null,"Htot","Irraggiamento mensile sulla superficie considerata in assenza di ostruzioni ai raggi solari"]
[null,null,{"$f":"Dati!R6","v":"Lat. = 45°"},null,{"$f":"Dati!N13","v":-5},null,null,"Tm","Temperatura media esterna giornaliera"]

{"sheet":"riepilogo","index":7,"n_rows":53,"n_cols":14,"rows_kept":53,"cut":false,"hidden":false,"merged":[[5,6,5,8],[6,11,6,12],[5,9,5,13],[52,2,52,13],[51,2,51,13],[50,2,50,13],[6,9,6,10]]}
[]
[]
[]
[]
[]
[null,null,null,null,"Radiazione","Energia fornita","Fabbisogno al generatore (*)",null,null,"Copertura"]
[null,null,null,null,"sui collett.","imp.solare","ACS","Riscald.","Totale","ACS",null,"RISCALDAMENTO",null,"Totale"]
[null,null,null,null,"kWh","kWh","kWh","kWh","kWh","kWh","%","kWh","%","%"]
[null,null,"gennaio",null,{"$f":"'UNI8477'!E18*superficie","v":509.27134624530572},{"$f":"+fc!AE35","v":247.26443917049417},{"$f":"+fc!S35","v":1109.4039749999999},{"$f":"+fc!R35","v":0},{"$f":"SUM(G9:H9)","v":1109.4039749999999},{"$f":"+fc!AD35","v":247.26443917049417},{"$f":"IF(ISERROR(+fc!AH35),,+fc!AH35)","v":0.22288043376669367},{"$f":"+fc!AC35","v":0},{"$f":"IF(ISERROR(+fc!AG35),,+fc!AG35)","v":0},{"$f":"IF(ISERROR(+fc!AF35),,+fc!AF35)","v":0.22288043376669367}]
[null,null,"febbraio",null,{"$f":"'UNI8477'!F18*superficie","v":698.70190520893004},{"$f":"+fc!AE36","v":366.03832491569671},{"$f":"+fc!S36","v":1002.0422999999998},{"$f":"+fc!R36","v":0},{"$f":"SUM(G10:H10)","v":1002.0422999999998},{"$f":"+fc!AD36","v":366.03832491569671},{"$f":"IF(ISERROR(+fc!AH36),,+fc!AH36)","v":0.36529228847494438},{"$f":"+fc!AC36","v":0},{"$f":"IF(ISERROR(+fc!AG36),,+fc!AG36)","v":0},{"$f":"IF(ISERROR(+fc!AF36),,+fc!AF36)","v":0.36529228847494438}]
[null,null,"marzo",null,{"$f":"'UNI8477'!G18*superficie","v":1064.4677752345574},{"$f":"+fc!AE37","v":568.16688810748576},{"$f":"+fc!S37","v":1109.4039749999999},{"$f":"+fc!R37","v":0},1109.4039749999999,{"$f":"+fc!AD37","v":568.16688810748576},{"$f":"IF(ISERROR(+fc!AH37),,+fc!AH37)","v":0.51213705819603339},{"$f":"+fc!AC37","v":0},{"$f":"IF(ISERROR(+fc!AG37),,+fc!AG37)","v":0},{"$f":"IF(ISERROR(+fc!AF37),,+fc!AF37)","v":0.51213705819603339}]
[null,null,"aprile",null,{"$f":"'UNI8477'!H18*superficie","v":1151.9172819973392},{"$f":"+fc!AE38","v":616.99343167775748},{"$f":"+fc!S38","v":1073.6167499999999},{"$f":"+fc!R38","v":0},1073.6167499999999,{"$f":"+fc!AD38","v":616.99343167775748},{"$f":"IF(ISERROR(+fc!AH38),,+fc!AH38)","v":0.57468685327213598},{"$f":"+fc!AC38","v":0},{"$f":"IF(ISERROR(+fc!AG38),,+fc!AG38)","v":0},{"$f":"IF(ISERROR(+fc!AF38),,+fc!AF38)","v":0.57468685327213598}]
[null,null,"maggio",null,{"$f":"'UNI8477'!I18*superficie","v":1376.3981237901039},{"$f":"+fc!AE39","v":731.87090654382484},{"$f":"+fc!S39","v":1109.4039749999999},{"$f":"+fc!R39","v":0},1109.4039749999999,{"$f":"+fc!AD39","v":731.87090654382484},{"$f":"IF(ISERROR(+fc!AH39),,+fc!AH39)","v":0.65969738980232595},{"$f":"+fc!AC39","v":0},{"$f":"IF(ISERROR(+fc!AG39),,+fc!AG39)","v":0},{"$f":"IF(ISERROR(+fc!AF39),,+fc!AF39)","v":0.65969738980232595}]
[null,null,"giugno",null,{"$f":"'UNI8477'!J18*superficie","v":1409.2070286226349},{"$f":"+fc!AE40","v":749.98806461987715},{"$f":"+fc!S40","v":1073.6167499999999},{"$f":"+fc!R40","v":0},1073.6167499999999,{"$f":"+fc!AD40","v":749.98806461987715},{"$f":"IF(ISERROR(+fc!AH40),,+fc!AH40)","v":0.69856218675786985},{"$f":"+fc!AC40","v":0},{"$f":"IF(ISERROR(+fc!AG40),,+fc!AG40)","v":0},{"$f":"IF(ISERROR(+fc!AF40),,+fc!AF40)","v":0.69856218675786985}]
[null,null,"luglio",null,{"$f":"'UNI8477'!K18*superficie","v":1610.4174182258971},{"$f":"+fc!AE41","v":845.12493007697913},{"$f":"+fc!S41","v":1109.4039749999999},{"$f":"+fc!R41","v":0},1109.4039749999999,{"$f":"+fc!AD41","v":845.12493007697913},{"$f":"IF(ISERROR(+fc!AH41),,+fc!AH41)","v":0.76178285739149187},{"$f":"+fc!AC41","v":0},{"$f":"IF(ISERROR(+fc!AG41),,+fc!AG41)","v":0},{"$f":"IF(ISERROR(+fc!AF41),,+fc!AF41)","v":0.76178285739149187}]
[null,null,"agosto",null,{"$f":"'UNI8477'!L18*superficie","v":1448.7183039851473},{"$f":"+fc!AE42","v":774.70294069886199},{"$f":"+fc!S42","v":1109.4039749999999},{"$f":"+fc!R42","v":0},1109.4039749999999,{"$f":"+fc!AD42","v":774.70294069886199},{"$f":"IF(ISERROR(+fc!AH42),,+fc!AH42)","v":0.6983055389709254},{"$f":"+fc!AC42","v":0},{"$f":"IF(ISERROR(+fc!AG42),,+fc!AG42)","v":0},{"$f":"IF(ISERROR(+fc!AF42),,+fc!AF42)","v":0.6983055389709254}]
[null,null,"settembre",null,{"$f":"'UNI8477'!M18*superficie","v":1160.9061088195735},{"$f":"+fc!AE43","v":632.15317527927118},{"$f":"+fc!S43","v":1073.6167499999999},{"$f":"+fc!R43","v":0},1073.6167499999999,{"$f":"+fc!AD43","v":632.15317527927118},{"$f":"IF(ISERROR(+fc!AH43),,+fc!AH43)","v":0.58880710950091941},{"$f":"+fc!AC43","v":0},{"$f":"IF(ISERROR(+fc!AG43),,+fc!AG43)","v":0},{"$f":"IF(ISERROR(+fc!AF43),,+fc!AF43)","v":0.58880710950091941}]
[null,null,"ottobre",null,{"$f":"'UNI8477'!N18*superficie","v":873.16750819168374},{"$f":"+fc!AE44","v":476.66029261182268},{"$f":"+fc!S44","v":1109.4039749999999},{"$f":"+fc!R44","v":0},1109.4039749999999,{"$f":"+fc!AD44","v":476.66029261182268},{"$f":"IF(ISERROR(+fc!AH44),,+fc!AH44)","v":0.42965439402885025},{"$f":"+fc!AC44","v":0},{"$f":"IF(ISERROR(+fc!AG44),,+fc!AG44)","v":0},{"$f":"IF(ISERROR(+fc!AF44),,+fc!AF44)","v":0.42965439402885025}]
[null,null,"novembre",null,{"$f":"'UNI8477'!O18*superficie","v":556.42888062828752},{"$f":"+fc!AE45","v":287.83762386414384},{"$f":"+fc!S45","v":1073.6167499999999},{"$f":"+fc!R45","v":0},1073.6167499999999,{"$f":"+fc!AD45","v":287.83762386414384},{"$f":"IF(ISERROR(+fc!AH45),,+fc!AH45)","v":0.26810090645860718},{"$f":"+fc!AC45","v":0},{"$f":"IF(ISERROR(+fc!AG45),,+fc!AG45)","v":0},{"$f":"IF(ISERROR(+fc!AF45),,+fc!AF45)","v":0.26810090645860718}]
[null,null,"dicembre",null,{"$f":"'UNI8477'!P18*superficie","v":517.64650003829047},{"$f":"+fc!AE46","v":255.74868213978442},{"$f":"+fc!S46","v":1109.4039749999999},{"$f":"+fc!R46","v":0},1109.4039749999999,{"$f":"+fc!AD46","v":255.74868213978442},{"$f":"IF(ISERROR(+fc!AH46),,+fc!AH46)","v":0.23052800233547427},{"$f":"+fc!AC46","v":0},{"$f":"IF(ISERROR(+fc!AG46),,+fc!AG46)","v":0},{"$f":"IF(ISERROR(+fc!AF46),,+fc!AF46)","v":0.23052800233547427}]
[null,null,"Totale",null,{"$f":"SUM(E9:E20)","v":12377.248180987752},6552.549699706,13062.337124999996,0,13062.337124999996,6552.549699706,{"$f":"IF(ISERROR(+fc!AH47),,+fc!AH47)","v":0.5016368538800825},{"$f":"SUM(L9:L20)","v":0},{"$f":"IF(ISERROR(+fc!AG47),,+fc!AG47)","v":0},{"$f":"IF(ISERROR(+fc!AF47),,+fc!AF47)","v":0.5016368538800825}]
[]
[null,null,"Resa dell'impianto solare:",null,null,{"$f":"+pr_disp/superficie","v":819.06871246324999},"kWh/m2 anno",null,{"$f":"+superficie","v":8},null,null,null,"% solare su E.prim. ACS:",{"$f":"+cti_show!K48","v":0.45584748914714701}]
[]
[]
[]
[]
[]
[]
[]
[]
[]
[]
[]
[]
[]
[]
[]
[]
[]
[]
[]
[]
[]
[]
[]
[]
[]
[]
[]
[null,null,"(*) per ACS: fabbisogno utile + dispersioni accumulo, distribuzione, erogazione - per RISC: fabbisogno termico al generatore"]
[null,null,"Non sono considerati i fenomeni di ombreggiamento e/o di ostruzione ai raggi solari dati da ostacoli presenti in sito o dal profilo orografico circostante."]
[null,null,"Paradigma s.r.l. non si assume alcuna responsabilità per i dati forniti da ParaSol, che sono puramente indicativi e soggetti a calcolo più dettagliato. "]

{"sheet":"relazione","index":8,"n_rows":133,"n_cols":13,"rows_kept":133,"cut":false,"hidden":false,"merged":[[121,10,123,12],[121,4,123,5],[121,6,123,6],[121,7,123,9],[105,7,108,9],[105,10,108,11],[112,6,115,9],[112,10,115,11],[89,2,91,13],[5,5,5,9],[6,5,6,9],[7,5,7,6],[70,5,70,7],[70,8,70,12]]}
[]
[]
[]
[null,null,null,"Simulazione impianto solare"]
[]
[null,null,null,"Committente:",null,{"$f":"+Dati!E6","v":0}]
[null,null,null,"Riferimento:",null,{"$f":"+Dati!E8","v":0}]
[null,null,null,"Data:",null,{"$f":"+TODAY()","v":"2018-01-29"}]
[]
[null,null,null,"Dati generali"]
[null,null,null,"Località e dati climatici:",null,null,null,null,{"$f":"+Dati!N6","v":"Brescia"}]
[null,null,null,"Tipologia collettori:",null,null,null,null,{"$f":"+Dati!E11","v":"AQUA PLASMA"}]
[null,null,null,"Superficie collettori:",null,null,null,null,{"$f":"+superficie","v":8},"m2"]
[null,null,null,"Inclinazione:",null,null,null,null,{"$f":"+Dati!E13","v":30},"°"]
[null,null,null,"Azimut:",null,null,null,null,{"$f":"+Dati!N13","v":-5},"°"]
[null,null,null,"Volume accumulo solare",null,null,null,null,{"$f":"+volume","v":500},"litri"]
[]
[null,null,null,"Fabbisogno acqua sanitaria",null,null,{"$f":"+ACS","v":true}]
[null,null,null,"Tipologia",null,null,null,null,{"$f":"IF(G18=TRUE,+fabb_ACS!D5,\"-\")","v":"Dormitori, residence, B&B"}]
[null,null,null,"Utenza",null,null,null,null,{"$f":"IF(G18=TRUE,+fabb_ACS!D6&\" \"&fabb_ACS!E6,\"-\")","v":"40 litri/G per letto"}]
[null,null,null,null,null,null,null,null,{"$f":"IF(G18=TRUE,+fabb_ACS!D7,\"-\")","v":25},{"$f":"+fabb_ACS!E7","v":"letti"}]
[null,null,null,"Consumo giornaliero",null,null,null,null,{"$f":"IF(G18=TRUE,++fabb_ACS!D8,\"-\")","v":1000},{"$f":"+fabb_ACS!E8","v":"litri / giorno (Vw)"}]
[null,null,null,"Ricircolo",null,null,null,null,{"$f":"IF(G18=TRUE,IF(+Tabelle5!C36=TRUE,\"Presente\",\"Assente\"),\"-\")","v":"Presente"}]
[null,null,null,"Temperatura ACS:",null,null,null,null,{"$f":"IF(G18=TRUE,+fabb_ACS!L5,\"-\")","v":40},"°C"]
[null,null,null,"Temperature acqua fredda:",null,null,null,null,{"$f":"IF(G18=TRUE,+fabb_ACS!L6& \"°C (estate) / \"&fabb_ACS!L7&\"°C (inverno)\",\"-\")","v":"13°C (estate) / °C (inverno)"}]
[null,null,null,"Fabbisogno energetico giornaliero",null,null,null,null,{"$f":"IF(G18=TRUE,+fabb_ACS!D9,\"-\")","v":30.862060185185182},"kWh/giorno"]
[null,null,null,"Fabbisogno annuo per ACS (comprese dispersioni ricircolo):",null,null,null,null,{"$f":"IF(G18=TRUE,+fabb_ACS!G17+fabb_ACS!G18,\"-\")","v":12424.609124999999},"kWh"]
[]
[null,null,null,"Fabbisogno per riscaldamento",null,null,null,{"$f":"+INTEGRAZ","v":false}]
[null,null,null,"Fabbisogno annuo per riscaldamento:",null,null,null,null,{"$f":"+IF(H29=TRUE,SUM(mesi2),\"-\")","v":"-"},"kWh"]
[]
[]
[]
[]
[]
[]
[]
[]
[]
[]
[]
[]
[]
[]
[]
[]
[]
[]
[]
[]
[]
[]
[]
[]
[]
[null,null,null,"Risultati solari:"]
[]
[null,null,null,"Potenza solare installata:",null,null,null,{"$f":"+superficie*0.7","v":5.6},"kW"]
[null,null,null,"Radiazione sui collettori solari:",null,null,null,{"$f":"+riepilogo!E21","v":12377.248180987752},"kWh / anno"]
[null,null,null,"Energia fornita dai collettori:",null,null,null,{"$f":"+pr_disp","v":6552.549699706},"kWh / anno"]
[null,null,null,"      - di cui per ACS:",null,null,null,{"$f":"+riepilogo!J21","v":6552.549699706},"kWh / anno"]
[null,null,null,"      - di cui per riscaldamento:",null,null,null,{"$f":"+riepilogo!L21","v":0},"kWh / anno"]
[]
[]
[null,null,null,{"$f":"+riepilogo!C23","v":"Resa dell'impianto solare:"},null,null,null,{"$f":"+riepilogo!F23","v":819.06871246324999},"kWh/m2 anno"]
[null,null,null,{"$f":"\"Risparmio \"&Tabelle6!E10&\" all'anno:\"","v":"Risparmio metano all'anno:"},null,null,null,{"$f":"+comb_evitato","v":766},{"$f":"+unità_comb","v":"m3 di metano"}]
[null,null,null,"CO2 evitata:",null,null,null,{"$f":"+Tabelle6!G20","v":1509.02},"kg/anno"]
[]
[]
[]
[null,null,null,null,"Energia","Fabbisogno (*)",null,null,"Copertura solare (*)"]
[null,null,null,null,"solare","Qw,gn,out","QH,gn,out","Qgn,out","Qw,sol,out","fw","QH,sol,out","fH","f"]
[null,null,null,null,"prodotta","ACS","Riscald.","Totale","ACS","ACS","Riscald.","Riscald.","Totale"]
[null,null,null,null,"kWh","kWh","kWh","kWh","kWh","%","kWh","%","%"]
[null,null,null,"gen",{"$f":"+riepilogo!F9","v":247.26443917049417},{"$f":"+riepilogo!G9","v":1109.4039749999999},{"$f":"+riepilogo!H9","v":0},{"$f":"+riepilogo!I9","v":1109.4039749999999},{"$f":"+riepilogo!J9","v":247.26443917049417},{"$f":"+riepilogo!K9","v":0.22288043376669367},{"$f":"+riepilogo!L9","v":0},{"$f":"+riepilogo!M9","v":0},{"$f":"+riepilogo!N9","v":0.22288043376669367}]
[null,null,null,"feb",{"$f":"+riepilogo!F10","v":366.03832491569671},{"$f":"+riepilogo!G10","v":1002.0422999999998},{"$f":"+riepilogo!H10","v":0},{"$f":"+riepilogo!I10","v":1002.0422999999998},{"$f":"+riepilogo!J10","v":366.03832491569671},{"$f":"+riepilogo!K10","v":0.36529228847494438},{"$f":"+riepilogo!L10","v":0},{"$f":"+riepilogo!M10","v":0},{"$f":"+riepilogo!N10","v":0.36529228847494438}]
[null,null,null,"mar",{"$f":"+riepilogo!F11","v":568.16688810748576},{"$f":"+riepilogo!G11","v":1109.4039749999999},{"$f":"+riepilogo!H11","v":0},{"$f":"+riepilogo!I11","v":1109.4039749999999},{"$f":"+riepilogo!J11","v":568.16688810748576},{"$f":"+riepilogo!K11","v":0.51213705819603339},{"$f":"+riepilogo!L11","v":0},{"$f":"+riepilogo!M11","v":0},{"$f":"+riepilogo!N11","v":0.51213705819603339}]
[null,null,null,"apr",{"$f":"+riepilogo!F12","v":616.99343167775748},{"$f":"+riepilogo!G12","v":1073.6167499999999},{"$f":"+riepilogo!H12","v":0},{"$f":"+riepilogo!I12","v":1073.6167499999999},{"$f":"+riepilogo!J12","v":616.99343167775748},{"$f":"+riepilogo!K12","v":0.57468685327213598},{"$f":"+riepilogo!L12","v":0},{"$f":"+riepilogo!M12","v":0},{"$f":"+riepilogo!N12","v":0.57468685327213598}]
[null,null,null,"mag",{"$f":"+riepilogo!F13","v":731.87090654382484},{"$f":"+riepilogo!G13","v":1109.4039749999999},{"$f":"+riepilogo!H13","v":0},{"$f":"+riepilogo!I13","v":1109.4039749999999},{"$f":"+riepilogo!J13","v":731.87090654382484},{"$f":"+riepilogo!K13","v":0.65969738980232595},{"$f":"+riepilogo!L13","v":0},{"$f":"+riepilogo!M13","v":0},{"$f":"+riepilogo!N13","v":0.65969738980232595}]
[null,null,null,"giu",{"$f":"+riepilogo!F14","v":749.98806461987715},{"$f":"+riepilogo!G14","v":1073.6167499999999},{"$f":"+riepilogo!H14","v":0},{"$f":"+riepilogo!I14","v":1073.6167499999999},{"$f":"+riepilogo!J14","v":749.98806461987715},{"$f":"+riepilogo!K14","v":0.69856218675786985},{"$f":"+riepilogo!L14","v":0},{"$f":"+riepilogo!M14","v":0},{"$f":"+riepilogo!N14","v":0.69856218675786985}]
[null,null,null,"lug",{"$f":"+riepilogo!F15","v":845.12493007697913},{"$f":"+riepilogo!G15","v":1109.4039749999999},{"$f":"+riepilogo!H15","v":0},{"$f":"+riepilogo!I15","v":1109.4039749999999},{"$f":"+riepilogo!J15","v":845.12493007697913},{"$f":"+riepilogo!K15","v":0.76178285739149187},{"$f":"+riepilogo!L15","v":0},{"$f":"+riepilogo!M15","v":0},{"$f":"+riepilogo!N15","v":0.76178285739149187}]
[null,null,null,"ago",{"$f":"+riepilogo!F16","v":774.70294069886199},{"$f":"+riepilogo!G16","v":1109.4039749999999},{"$f":"+riepilogo!H16","v":0},{"$f":"+riepilogo!I16","v":1109.4039749999999},{"$f":"+riepilogo!J16","v":774.70294069886199},{"$f":"+riepilogo!K16","v":0.6983055389709254},{"$f":"+riepilogo!L16","v":0},{"$f":"+riepilogo!M16","v":0},{"$f":"+riepilogo!N16","v":0.6983055389709254}]
[null,null,null,"set",{"$f":"+riepilogo!F17","v":632.15317527927118},{"$f":"+riepilogo!G17","v":1073.6167499999999},{"$f":"+riepilogo!H17","v":0},{"$f":"+riepilogo!I17","v":1073.6167499999999},{"$f":"+riepilogo!J17","v":632.15317527927118},{"$f":"+riepilogo!K17","v":0.58880710950091941},{"$f":"+riepilogo!L17","v":0},{"$f":"+riepilogo!M17","v":0},{"$f":"+riepilogo!N17","v":0.58880710950091941}]
[null,null,null,"ott",{"$f":"+riepilogo!F18","v":476.66029261182268},{"$f":"+riepilogo!G18","v":1109.4039749999999},{"$f":"+riepilogo!H18","v":0},{"$f":"+riepilogo!I18","v":1109.4039749999999},{"$f":"+riepilogo!J18","v":476.66029261182268},{"$f":"+riepilogo!K18","v":0.42965439402885025},{"$f":"+riepilogo!L18","v":0},{"$f":"+riepilogo!M18","v":0},{"$f":"+riepilogo!N18","v":0.42965439402885025}]
[null,null,null,"nov",{"$f":"+riepilogo!F19","v":287.83762386414384},{"$f":"+riepilogo!G19","v":1073.6167499999999},{"$f":"+riepilogo!H19","v":0},{"$f":"+riepilogo!I19","v":1073.6167499999999},{"$f":"+riepilogo!J19","v":287.83762386414384},{"$f":"+riepilogo!K19","v":0.26810090645860718},{"$f":"+riepilogo!L19","v":0},{"$f":"+riepilogo!M19","v":0},{"$f":"+riepilogo!N19","v":0.26810090645860718}]
[null,null,null,"dic",{"$f":"+riepilogo!F20","v":255.74868213978442},{"$f":"+riepilogo!G20","v":1109.4039749999999},{"$f":"+riepilogo!H20","v":0},{"$f":"+riepilogo!I20","v":1109.4039749999999},{"$f":"+riepilogo!J20","v":255.74868213978442},{"$f":"+riepilogo!K20","v":0.23052800233547427},{"$f":"+riepilogo!L20","v":0},{"$f":"+riepilogo!M20","v":0},{"$f":"+riepilogo!N20","v":0.23052800233547427}]
[null,null,null,{"$f":"+riepilogo!C21","v":"Totale"},{"$f":"+riepilogo!F21","v":6552.549699706},{"$f":"+riepilogo!G21","v":13062.337124999996},{"$f":"+riepilogo!H21","v":0},{"$f":"+riepilogo!I21","v":13062.337124999996},{"$f":"SUM(I75:I86)","v":6552.549699706},{"$f":"+riepilogo!K21","v":0.5016368538800825},{"$f":"SUM(K75:K86)","v":0},{"$f":"+riepilogo!M21","v":0},{"$f":"+riepilogo!N21","v":0.5016368538800825}]
[]
[]
[null,null,"(*) per ACS: fabbisogno utile + dispersioni accumulo, distribuzione, erogazione - per RISC: fabbisogno termico al generatore\nNon sono considerati i fenomeni di ombreggiamento e/o di ostruzione ai raggi solari dati da ostacoli presenti in sito o dal profilo orografico circostante.\nParadigma non fornisce alcuna garanzia, né esplicita né implicita e non si assume alcuna responsabilità \nper i dati forniti dalla presente simulazione. Essi sono puramente indicativi e soggetti a calcolo più dettagliato. \nParadigma non garantisce l'uso del software in tutte le situazioni. "]
[]
[]
[]
[]
[]
[]
[]
[]
[]
[]
[]
[]
[]
[]
[]
[null,null,null,null,null,null,null,{"$f":"+Tabelle5!H34","v":1000},null,null,"litri"]
[]
[]
[]
[]
[]
[]
[null,null,null,null,null,null,{"$f":"365*Tabelle5!H34","v":365000},null,null,null,"litri"]
[]
[]
[]
[]
[]
[]
[]
[]
[null,null,null,null,{"$f":"+J87","v":0.5016368538800825},null,"=",{"$f":"+E122*G113","v":183097.4516662301},null,null,"litri/anno"]
[]
[]
[]
[]
[]
[]
[]
[]
[]
[]
[null,null,null,null,{"$f":"+ROUND(H67/1000*20/0.2,0)","v":151}]

{"sheet":"relazione22","index":9,"n_rows":90,"n_cols":13,"rows_kept":90,"cut":false,"hidden":true,"merged":[[89,2,91,13],[70,5,70,7],[70,8,70,12],[5,5,5,9],[6,5,6,9],[8,5,8,6]]}
[]
[]
[]
[null,null,null,"Simulazione impianto solare"]
[]
[null,null,null,"Committente:",null,{"$f":"+Dati!E6","v":0}]
[null,null,null,"Riferimento:",null,{"$f":"+Dati!E8","v":0}]
[]
[null,null,null,"Data:",null,{"$f":"+TODAY()","v":"2018-01-29"}]
[]
[null,null,null,"Dati generali"]
[null,null,null,"Località e dati climatici:",null,null,null,null,{"$f":"+Dati!N6","v":"Brescia"}]
[null,null,null,"Tipologia collettori:",null,null,null,null,{"$f":"+Dati!E11","v":"AQUA PLASMA"}]
[null,null,null,"Superficie collettori:",null,null,null,null,{"$f":"+superficie","v":8},"m2"]
[null,null,null,"Inclinazione:",null,null,null,null,{"$f":"+Dati!E13","v":30},"°"]
[null,null,null,"Azimut:",null,null,null,null,{"$f":"+Dati!N13","v":-5},"°"]
[null,null,null,"Volume accumulo solare",null,null,null,null,{"$f":"+volume","v":500},"litri"]
[]
[null,null,null,"Fabbisogno acqua sanitaria",null,null,{"$f":"+ACS","v":true}]
[null,null,null,"Tipologia",null,null,null,null,{"$f":"IF(G19=TRUE,+fabb_ACS!D5,\"-\")","v":"Dormitori, residence, B&B"}]
[null,null,null,"Utenza",null,null,null,null,{"$f":"IF(G19=TRUE,+fabb_ACS!D6&\" \"&fabb_ACS!E6,\"-\")","v":"40 litri/G per letto"}]
[null,null,null,null,null,null,null,null,{"$f":"IF(G19=TRUE,+fabb_ACS!D7,\"-\")","v":25},{"$f":"+fabb_ACS!E7","v":"letti"}]
[null,null,null,"Consumo giornaliero",null,null,null,null,{"$f":"IF(G19=TRUE,++fabb_ACS!D8,\"-\")","v":1000},{"$f":"+fabb_ACS!E8","v":"litri / giorno (Vw)"}]
[null,null,null,"Ricircolo",null,null,null,null,{"$f":"IF(G19=TRUE,IF(+Tabelle5!C36=TRUE,\"Presente\",\"Assente\"),\"-\")","v":"Presente"}]
[null,null,null,"Temperatura ACS:",null,null,null,null,{"$f":"IF(G19=TRUE,+fabb_ACS!L5,\"-\")","v":40},"°C"]
[null,null,null,"Temperature acqua fredda:",null,null,null,null,{"$f":"IF(G19=TRUE,+fabb_ACS!L6& \"°C (estate) / \"&fabb_ACS!L7&\"°C (inverno)\",\"-\")","v":"13°C (estate) / °C (inverno)"}]
[null,null,null,"Fabbisogno energetico giornaliero",null,null,null,null,{"$f":"IF(G19=TRUE,+fabb_ACS!D9,\"-\")","v":30.862060185185182},"kWh/giorno"]
[null,null,null,"Fabbisogno annuo per ACS (comprese dispersioni ricircolo):",null,null,null,null,{"$f":"IF(G19=TRUE,+fabb_ACS!G17+fabb_ACS!G18,\"-\")","v":12424.609124999999},"kWh"]
[]
[null,null,null,"Fabbisogno per riscaldamento",null,null,null,{"$f":"+INTEGRAZ","v":false}]
[null,null,null,"Fabbisogno annuo per riscaldamento:",null,null,null,null,{"$f":"+IF(H30=TRUE,SUM(mesi2),\"-\")","v":"-"},"kWh"]
[]
[]
[]
[]
[]
[]
[]
[]
[]
[]
[]
[]
[]
[]
[]
[]
[]
[]
[]
[]
[]
[]
[]
[]
[null,null,null,"Risultati solari:"]
[]
[null,null,null,"Potenza solare installata:",null,null,null,{"$f":"+superficie*0.7","v":5.6},"kW"]
[null,null,null,"Radiazione sui collettori solari:",null,null,null,{"$f":"+riepilogo!E21","v":12377.248180987752},"kWh / anno"]
[null,null,null,"Energia fornita dai collettori:",null,null,null,{"$f":"+pr_disp","v":6552.549699706},"kWh / anno"]
[null,null,null,"      - di cui per ACS:",null,null,null,{"$f":"+riepilogo!J21","v":6552.549699706},"kWh / anno"]
[null,null,null,"      - di cui per riscaldamento:",null,null,null,{"$f":"+riepilogo!L21","v":0},"kWh / anno"]
[]
[]
[null,null,null,{"$f":"+riepilogo!C23","v":"Resa dell'impianto solare:"},null,null,null,{"$f":"+riepilogo!F23","v":819.06871246324999},"kWh/m2 anno"]
[null,null,null,{"$f":"\"Risparmio \"&Tabelle6!E10&\" all'anno:\"","v":"Risparmio metano all'anno:"},null,null,null,{"$f":"+comb_evitato","v":766},{"$f":"+unità_comb","v":"m3 di metano"}]
[null,null,null,"CO2 evitata:",null,null,null,{"$f":"+Tabelle6!G20","v":1509.02},"kg/anno"]
[]
[]
[]
[null,null,null,null,"Energia","Fabbisogno (*)",null,null,"Copertura solare (*)"]
[null,null,null,null,"solare","Qw,gn,out","QH,gn,out","Qgn,out","Qw,sol,out","fw","QH,sol,out","fH","f"]
[null,null,null,null,"prodotta","ACS","Riscald.","Totale","ACS","ACS","Riscald.","Riscald.","Totale"]
[null,null,null,null,"kWh","kWh","kWh","kWh","kWh","%","kWh","%","%"]
[null,null,null,"gen",{"$f":"+riepilogo!F9","v":247.26443917049417},{"$f":"+riepilogo!G9","v":1109.4039749999999},{"$f":"+riepilogo!H9","v":0},{"$f":"+riepilogo!I9","v":1109.4039749999999},{"$f":"+riepilogo!J9","v":247.26443917049417},{"$f":"+riepilogo!K9","v":0.22288043376669367},{"$f":"+riepilogo!L9","v":0},{"$f":"+riepilogo!M9","v":0},{"$f":"+riepilogo!N9","v":0.22288043376669367}]
[null,null,null,"feb",{"$f":"+riepilogo!F10","v":366.03832491569671},{"$f":"+riepilogo!G10","v":1002.0422999999998},{"$f":"+riepilogo!H10","v":0},{"$f":"+riepilogo!I10","v":1002.0422999999998},{"$f":"+riepilogo!J10","v":366.03832491569671},{"$f":"+riepilogo!K10","v":0.36529228847494438},{"$f":"+riepilogo!L10","v":0},{"$f":"+riepilogo!M10","v":0},{"$f":"+riepilogo!N10","v":0.36529228847494438}]
[null,null,null,"mar",{"$f":"+riepilogo!F11","v":568.16688810748576},{"$f":"+riepilogo!G11","v":1109.4039749999999},{"$f":"+riepilogo!H11","v":0},{"$f":"+riepilogo!I11","v":1109.4039749999999},{"$f":"+riepilogo!J11","v":568.16688810748576},{"$f":"+riepilogo!K11","v":0.51213705819603339},{"$f":"+riepilogo!L11","v":0},{"$f":"+riepilogo!M11","v":0},{"$f":"+riepilogo!N11","v":0.51213705819603339}]
[null,null,null,"apr",{"$f":"+riepilogo!F12","v":616.99343167775748},{"$f":"+riepilogo!G12","v":1073.6167499999999},{"$f":"+riepilogo!H12","v":0},{"$f":"+riepilogo!I12","v":1073.6167499999999},{"$f":"+riepilogo!J12","v":616.99343167775748},{"$f":"+riepilogo!K12","v":0.57468685327213598},{"$f":"+riepilogo!L12","v":0},{"$f":"+riepilogo!M12","v":0},{"$f":"+riepilogo!N12","v":0.57468685327213598}]
[null,null,null,"mag",{"$f":"+riepilogo!F13","v":731.87090654382484},{"$f":"+riepilogo!G13","v":1109.4039749999999},{"$f":"+riepilogo!H13","v":0},{"$f":"+riepilogo!I13","v":1109.4039749999999},{"$f":"+riepilogo!J13","v":731.87090654382484},{"$f":"+riepilogo!K13","v":0.65969738980232595},{"$f":"+riepilogo!L13","v":0},{"$f":"+riepilogo!M13","v":0},{"$f":"+riepilogo!N13","v":0.65969738980232595}]
[null,null,null,"giu",{"$f":"+riepilogo!F14","v":749.98806461987715},{"$f":"+riepilogo!G14","v":1073.6167499999999},{"$f":"+riepilogo!H14","v":0},{"$f":"+riepilogo!I14","v":1073.6167499999999},{"$f":"+riepilogo!J14","v":749.98806461987715},{"$f":"+riepilogo!K14","v":0.69856218675786985},{"$f":"+riepilogo!L14","v":0},{"$f":"+riepilogo!M14","v":0},{"$f":"+riepilogo!N14","v":0.69856218675786985}]
[null,null,null,"lug",{"$f":"+riepilogo!F15","v":845.12493007697913},{"$f":"+riepilogo!G15","v":1109.4039749999999},{"$f":"+riepilogo!H15","v":0},{"$f":"+riepilogo!I15","v":1109.4039749999999},{"$f":"+riepilogo!J15","v":845.12493007697913},{"$f":"+riepilogo!K15","v":0.76178285739149187},{"$f":"+riepilogo!L15","v":0},{"$f":"+riepilogo!M15","v":0},{"$f":"+riepilogo!N15","v":0.76178285739149187}]
[null,null,null,"ago",{"$f":"+riepilogo!F16","v":774.70294069886199},{"$f":"+riepilogo!G16","v":1109.4039749999999},{"$f":"+riepilogo!H16","v":0},{"$f":"+riepilogo!I16","v":1109.4039749999999},{"$f":"+riepilogo!J16","v":774.70294069886199},{"$f":"+riepilogo!K16","v":0.6983055389709254},{"$f":"+riepilogo!L16","v":0},{"$f":"+riepilogo!M16","v":0},{"$f":"+riepilogo!N16","v":0.6983055389709254}]
[null,null,null,"set",{"$f":"+riepilogo!F17","v":632.15317527927118},{"$f":"+riepilogo!G17","v":1073.6167499999999},{"$f":"+riepilogo!H17","v":0},{"$f":"+riepilogo!I17","v":1073.6167499999999},{"$f":"+riepilogo!J17","v":632.15317527927118},{"$f":"+riepilogo!K17","v":0.58880710950091941},{"$f":"+riepilogo!L17","v":0},{"$f":"+riepilogo!M17","v":0},{"$f":"+riepilogo!N17","v":0.58880710950091941}]
[null,null,null,"ott",{"$f":"+riepilogo!F18","v":476.66029261182268},{"$f":"+riepilogo!G18","v":1109.4039749999999},{"$f":"+riepilogo!H18","v":0},{"$f":"+riepilogo!I18","v":1109.4039749999999},{"$f":"+riepilogo!J18","v":476.66029261182268},{"$f":"+riepilogo!K18","v":0.42965439402885025},{"$f":"+riepilogo!L18","v":0},{"$f":"+riepilogo!M18","v":0},{"$f":"+riepilogo!N18","v":0.42965439402885025}]
[null,null,null,"nov",{"$f":"+riepilogo!F19","v":287.83762386414384},{"$f":"+riepilogo!G19","v":1073.6167499999999},{"$f":"+riepilogo!H19","v":0},{"$f":"+riepilogo!I19","v":1073.6167499999999},{"$f":"+riepilogo!J19","v":287.83762386414384},{"$f":"+riepilogo!K19","v":0.26810090645860718},{"$f":"+riepilogo!L19","v":0},{"$f":"+riepilogo!M19","v":0},{"$f":"+riepilogo!N19","v":0.26810090645860718}]
[null,null,null,"dic",{"$f":"+riepilogo!F20","v":255.74868213978442},{"$f":"+riepilogo!G20","v":1109.4039749999999},{"$f":"+riepilogo!H20","v":0},{"$f":"+riepilogo!I20","v":1109.4039749999999},{"$f":"+riepilogo!J20","v":255.74868213978442},{"$f":"+riepilogo!K20","v":0.23052800233547427},{"$f":"+riepilogo!L20","v":0},{"$f":"+riepilogo!M20","v":0},{"$f":"+riepilogo!N20","v":0.23052800233547427}]
[null,null,null,{"$f":"+riepilogo!C21","v":"Totale"},{"$f":"+riepilogo!F21","v":6552.549699706},{"$f":"+riepilogo!G21","v":13062.337124999996},{"$f":"+riepilogo!H21","v":0},{"$f":"+riepilogo!I21","v":13062.337124999996},{"$f":"SUM(I75:I86)","v":6552.549699706},{"$f":"+riepilogo!K21","v":0.5016368538800825},{"$f":"SUM(K75:K86)","v":0},{"$f":"+riepilogo!M21","v":0},{"$f":"+riepilogo!N21","v":0.5016368538800825}]
[]
[]
[null,null,"(*) per ACS: fabbisogno utile + dispersioni accumulo, distribuzione, erogazione - per RISC: fabbisogno primario x rendimento generatore\nNon sono considerati i fenomeni di ombreggiamento e/o di ostruzione ai raggi solari dati da ostacoli presenti in sito o dal profilo orografico circostante.\nParadigma non fornisce alcuna garanzia, né esplicita né implicita e non si assume alcuna responsabilità \nper i dati forniti dalla presente simulazione. Essi sono puramente indicativi e soggetti a calcolo più dettagliato. \nParadigma non garantisce l'uso del software in tutte le situazioni. "]

{"sheet":"Dettaglio mesi","index":10,"n_rows":52,"n_cols":16,"rows_kept":52,"cut":false,"hidden":true,"merged":[]}
[null,null,null,null,"GENNAIO","FEBBRAIO","MARZO","APRILE","MAGGIO","GIUGNO","LUGLIO","AGOSTO","SETTEMBRE","OTTOBRE","NOVEMBRE","DICEMBRE"]
["Componente diffusa della radiazione",null,"Hdh","MJ/m2",{"$f":"VLOOKUP(Tabelle2!localitàscelta,'Tabelle UNI'!AJ5:BJ105,4,FALSE)","v":2.4},{"$f":"VLOOKUP(Tabelle2!localitàscelta,'Tabelle UNI'!AJ5:BJ105,6,FALSE)","v":"3,5"},{"$f":"VLOOKUP(Tabelle2!localitàscelta,'Tabelle UNI'!AJ5:BJ105,8,FALSE)","v":"5,0"},{"$f":"VLOOKUP(Tabelle2!localitàscelta,'Tabelle UNI'!AJ5:BJ105,10,FALSE)","v":"6,7"},{"$f":"VLOOKUP(Tabelle2!localitàscelta,'Tabelle UNI'!AJ5:BJ105,12,FALSE)","v":"7,8"},{"$f":"VLOOKUP(Tabelle2!localitàscelta,'Tabelle UNI'!AJ5:BJ105,14,FALSE)","v":"8,2"},{"$f":"VLOOKUP(Tabelle2!localitàscelta,'Tabelle UNI'!AJ5:BJ105,16,FALSE)","v":"7,4"},{"$f":"VLOOKUP(Tabelle2!localitàscelta,'Tabelle UNI'!AJ5:BJ105,18,FALSE)","v":"6,7"},{"$f":"VLOOKUP(Tabelle2!localitàscelta,'Tabelle UNI'!AJ5:BJ105,20,FALSE)","v":"5,4"},{"$f":"VLOOKUP(Tabelle2!localitàscelta,'Tabelle UNI'!AJ5:BJ105,22,FALSE)","v":"3,9"},{"$f":"VLOOKUP(Tabelle2!localitàscelta,'Tabelle UNI'!AJ5:BJ105,24,FALSE)","v":"2,6"},{"$f":"VLOOKUP(Tabelle2!localitàscelta,'Tabelle UNI'!AJ5:BJ105,26,FALSE)","v":"2,1"}]
["Componente diretta della radiazione",null,"Hbh","MJ/m2",{"$f":"VLOOKUP(Tabelle2!localitàscelta,'Tabelle UNI'!AJ5:BJ105,5,FALSE)","v":"2,2"},{"$f":"VLOOKUP(Tabelle2!localitàscelta,'Tabelle UNI'!AJ5:BJ105,7,FALSE)","v":"4,3"},{"$f":"VLOOKUP(Tabelle2!localitàscelta,'Tabelle UNI'!AJ5:BJ105,9,FALSE)","v":"7,4"},{"$f":"VLOOKUP(Tabelle2!localitàscelta,'Tabelle UNI'!AJ5:BJ105,11,FALSE)","v":"9,4"},{"$f":"VLOOKUP(Tabelle2!localitàscelta,'Tabelle UNI'!AJ5:BJ105,13,FALSE)","v":"12,6"},{"$f":"VLOOKUP(Tabelle2!localitàscelta,'Tabelle UNI'!AJ5:BJ105,15,FALSE)","v":"14,3"},{"$f":"VLOOKUP(Tabelle2!localitàscelta,'Tabelle UNI'!AJ5:BJ105,17,FALSE)","v":"17,0"},{"$f":"VLOOKUP(Tabelle2!localitàscelta,'Tabelle UNI'!AJ5:BJ105,19,FALSE)","v":"13,5"},{"$f":"VLOOKUP(Tabelle2!localitàscelta,'Tabelle UNI'!AJ5:BJ105,21,FALSE)","v":"9,3"},{"$f":"VLOOKUP(Tabelle2!localitàscelta,'Tabelle UNI'!AJ5:BJ105,23,FALSE)","v":"5,3"},{"$f":"VLOOKUP(Tabelle2!localitàscelta,'Tabelle UNI'!AJ5:BJ105,25,FALSE)","v":"2,7"},{"$f":"VLOOKUP(Tabelle2!localitàscelta,'Tabelle UNI'!AJ5:BJ105,27,FALSE)","v":"2,2"}]
["Riflettanza ambiante circostante",null,"r",null,{"$f":"+Tabelle3!I3","v":0.22},{"$f":"+Tabelle3!I4","v":0.22},{"$f":"+Tabelle3!I5","v":0.22},{"$f":"+Tabelle3!I6","v":0.22},{"$f":"+Tabelle3!I7","v":0.22},{"$f":"+Tabelle3!I8","v":0.22},{"$f":"+Tabelle3!I9","v":0.22},{"$f":"+Tabelle3!I10","v":0.22},{"$f":"+Tabelle3!I11","v":0.22},{"$f":"+Tabelle3!I12","v":0.22},{"$f":"+Tabelle3!I13","v":0.22},{"$f":"+Tabelle3!I14","v":0.22}]
["Ennesimo giorno dell'anno",null,"n",null,17,47,75,105,135,162,198,228,258,288,318,344]
["Radiazione media globale al suolo sul piano orizzontale  UNI",null,"Hh","MJ/m2",{"$f":"E3+E2","v":4.5999999999999996},{"$f":"F3+F2","v":7.8},{"$f":"G3+G2","v":12.4},{"$f":"H3+H2","v":16.100000000000001},{"$f":"I3+I2","v":20.399999999999999},22.5,24.4,20.2,14.700000000000001,9.1999999999999993,5.3000000000000007,4.3000000000000007]
["Declinazione solare",null,"d","gradi °",{"$f":"23.45*SIN((360*(E5+284)/365)/180*PI())","v":-20.916962574476418},{"$f":"23.45*SIN((360*(F5+284)/365)/180*PI())","v":-12.954608093780696},{"$f":"23.45*SIN((360*(G5+284)/365)/180*PI())","v":-2.4177348051423611},{"$f":"23.45*SIN((360*(H5+284)/365)/180*PI())","v":9.4148933468800529},{"$f":"23.45*SIN((360*(I5+284)/365)/180*PI())","v":18.791917517696167},23.085911002836561,21.183693564513842,13.454959682356431,2.2168867832133041,-9.5993972342263003,-18.911954741226136,-23.049627643930577]
[null,null,null,"rad",{"$f":"E7/180*PI()","v":-0.36506986644104311},-0.22610056454197949,-4.2197432789797727E-2,0.16432088762716554,0.32798083344699785,0.40292515782188393,0.36972520043430035,0.23483334718021009,3.869197351101792E-2,-0.16754108794408623,-0.33007587822254825,-0.40229189374529173]
["Angolo orario al tramonto",null,"ws","gradi °",{"$f":"E10/PI()*180","v":67.529845549502454},76.700933650600049,87.580109777979487,99.544640831539482,109.89334682923106,115.22952752977012,112.8019558845571,103.84213175195883,92.218548065018638,80.262963105681067,69.964051949995408,64.817847273425684]
[null,null,null,"rad",{"$f":"ACOS(-TAN(lat)*TAN(E8))","v":1.1786181482020572},1.3386838315566849,1.528561274883822,1.7373817352255501,1.9180007282061529,2.011134650911937,1.9687655328749138,1.8123871013614292,1.6095172951432211,1.4008529736008679,1.221103064563779,1.1312848489761074]
["Funzioni intermedie",null,"Th",null,{"$f":"SIN(E8)*SIN(lat)","v":-0.25244741459647096},{"$f":"SIN(F8)*SIN(lat)","v":-0.15851852689847098},{"$f":"SIN(G8)*SIN(lat)","v":-2.9829236595863999E-2},{"$f":"SIN(H8)*SIN(lat)","v":0.11567022733221954},{"$f":"SIN(I8)*SIN(lat)","v":0.22778182916561709},0.27726429135797298,0.25551955148732503,0.16453024932957003,2.7352530884779212E-2,-0.11791597692277309,-0.22918378107587037,-0.27685231003679939]
[null,null,"Uh",null,{"$f":"COS(E8)*COS(lat)","v":0.66050760999670366},{"$f":"COS(F8)*COS(lat)","v":0.68910948087364088},{"$f":"COS(G8)*COS(lat)","v":0.70647732917915207},{"$f":"COS(H8)*COS(lat)","v":0.69758182208893083},{"$f":"COS(I8)*COS(lat)","v":0.66941425014856504},0.65048021702259406,0.65932522991898035,0.68769891453713194,0.7065775534604799,0.69720572457944441,0.6689355682663074,0.65065566809741071]
[null,null,"T",null,{"$f":"SIN(E8)*(SIN(lat)*COS(beta)-COS(lat)*SIN(beta)*COS(gamma))","v":-9.2882486176259799E-2},{"$f":"SIN(F8)*(SIN(lat)*COS(beta)-COS(lat)*SIN(beta)*COS(gamma))","v":-5.8323413241777464E-2},{"$f":"SIN(G8)*(SIN(lat)*COS(beta)-COS(lat)*SIN(beta)*COS(gamma))","v":-1.0975012995052682E-2},{"$f":"SIN(H8)*(SIN(lat)*COS(beta)-COS(lat)*SIN(beta)*COS(gamma))","v":4.2558321733511234E-2},{"$f":"SIN(I8)*(SIN(lat)*COS(beta)-COS(lat)*SIN(beta)*COS(gamma))","v":8.3807325309697839E-2},0.10201331136780596,9.4012811526402326E-2,6.0535294581479937E-2,1.006376348061336E-2,-4.3384596011793529E-2,-8.4323142748874341E-2,-0.10186173188171795]
[null,null,"U",null,{"$f":"COS(E8)*(COS(lat)*COS(beta)+SIN(lat)*SIN(beta)*COS(gamma))","v":0.90101345921407294},{"$f":"COS(F8)*(COS(lat)*COS(beta)+SIN(lat)*SIN(beta)*COS(gamma))","v":0.94002992205081781},{"$f":"COS(G8)*(COS(lat)*COS(beta)+SIN(lat)*SIN(beta)*COS(gamma))","v":0.96372179909207101},{"$f":"COS(H8)*(COS(lat)*COS(beta)+SIN(lat)*SIN(beta)*COS(gamma))","v":0.95158723547233681},{"$f":"COS(I8)*(COS(lat)*COS(beta)+SIN(lat)*SIN(beta)*COS(gamma))","v":0.91316320969649922},0.88733486430651931,0.89940054764755739,0.9381057364168095,0.96385851731461625,0.95107419230236356,0.91251022884954391,0.88757420110968532]
[null,null,"V",null,{"$f":"COS(E8)*SIN(beta)*SIN(gamma)","v":-4.0706038233110933E-2},{"$f":"COS(F8)*SIN(beta)*SIN(gamma)","v":-4.2468726250378321E-2},{"$f":"COS(G8)*SIN(beta)*SIN(gamma)","v":-4.353907924321445E-2},{"$f":"COS(H8)*SIN(beta)*SIN(gamma)","v":-4.299086322535621E-2},{"$f":"COS(I8)*SIN(beta)*SIN(gamma)","v":-4.1254940363931264E-2},-4.0088065880325222E-2,-4.0633170020964046E-2,-4.2381795280386075E-2,-4.3545255906989204E-2,-4.2967684931315649E-2,-4.1225439957416982E-2,-4.0098878652277327E-2]
[null,null,"U2+V2-T2",null,{"$f":"E14^2+E15^2-E13^2","v":0.80485507899526221},0.88205822652802501,0.93053490655636339,0.90555527028597271,0.82854534987207862,0.77856349874366937,0.80173399088357988,0.87817406737924641,0.93081815137654189,0.90450611804084347,0.82726406225168259,0.77902007012272323]
[null,null,"a)      w","rad",{"$f":"2*ATAN((-E15-SQRT(E16))/(E13-E14))","v":1.422484432399036},1.4636282265424991,1.5142721722957617,1.5703417840588616,1.6174613251662047,1.6407517805861576,1.6302614634867096,1.5901572328344264,1.5360796393390028,1.4800632473444111,1.4332036224458604,1.4107490711302435]
[null,null,"b)      w","rad",{"$f":"2*ATAN((-E15+SQRT(E16))/(E13-E14))","v":-1.5127791493899201},{"$f":"2*ATAN((-F15+SQRT(F16))/(F13-F14))","v":-1.5539229435333834},{"$f":"2*ATAN((-G15+SQRT(G16))/(G13-G14))","v":-1.6045668892866458},{"$f":"2*ATAN((-H15+SQRT(H16))/(H13-H14))","v":-1.6606365010497457},{"$f":"2*ATAN((-I15+SQRT(I16))/(I13-I14))","v":-1.7077560421570888},-1.7310464975770419,-1.720556180477594,-1.6804519498253108,-1.6263743563298871,-1.5703579643352954,-1.5234983394367447,-1.5010437881211278]
[null,null,"w1","rad",{"$f":"IF((E15*COS(E17))>(E14*SIN(E17)),E17,E18)","v":-1.5127791493899201},-1.5539229435333834,-1.6045668892866458,-1.6606365010497457,-1.7077560421570888,-1.7310464975770419,-1.720556180477594,-1.6804519498253108,-1.6263743563298871,-1.5703579643352954,-1.5234983394367447,-1.5010437881211278]
[null,null,"w2","rad",{"$f":"IF((E15*COS(E17))>(E14*SIN(E17)),E18,E17)","v":1.422484432399036},{"$f":"IF((F15*COS(F17))>(F14*SIN(F17)),F18,F17)","v":1.4636282265424991},{"$f":"IF((G15*COS(G17))>(G14*SIN(G17)),G18,G17)","v":1.5142721722957617},{"$f":"IF((H15*COS(H17))>(H14*SIN(H17)),H18,H17)","v":1.5703417840588616},{"$f":"IF((I15*COS(I17))>(I14*SIN(I17)),I18,I17)","v":1.6174613251662047},1.6407517805861576,1.6302614634867096,1.5901572328344264,1.5360796393390028,1.4800632473444111,1.4332036224458604,1.4107490711302435]
["Angolo all'apparire del sole sulla superficie",null,"w'","rad",{"$f":"IF(E16>0,SIGN(E19)*MIN(ABS(E19),ABS(E10)),IF((E13+E14)>0,-E10,0))","v":-1.1786181482020572},{"$f":"IF(F16>0,SIGN(F19)*MIN(ABS(F19),ABS(F10)),IF((F13+F14)>0,-F10,0))","v":-1.3386838315566849},{"$f":"IF(G16>0,SIGN(G19)*MIN(ABS(G19),ABS(G10)),IF((G13+G14)>0,-G10,0))","v":-1.528561274883822},{"$f":"IF(H16>0,SIGN(H19)*MIN(ABS(H19),ABS(H10)),IF((H13+H14)>0,-H10,0))","v":-1.6606365010497457},{"$f":"IF(I16>0,SIGN(I19)*MIN(ABS(I19),ABS(I10)),IF((I13+I14)>0,-I10,0))","v":-1.7077560421570888},-1.7310464975770419,-1.720556180477594,-1.6804519498253108,-1.6095172951432211,-1.4008529736008679,-1.221103064563779,-1.1312848489761074]
["Angolo allo scomparire del sole sulla superficie",null,"w''","rad",{"$f":"IF(E16>0,SIGN(E20)*MIN(ABS(E20),ABS(E10)),IF((E13+E14)>0,E10,0))","v":1.1786181482020572},{"$f":"IF(F16>0,SIGN(F20)*MIN(ABS(F20),ABS(F10)),IF((F13+F14)>0,F10,0))","v":1.3386838315566849},{"$f":"IF(G16>0,SIGN(G20)*MIN(ABS(G20),ABS(G10)),IF((G13+G14)>0,G10,0))","v":1.5142721722957617},{"$f":"IF(H16>0,SIGN(H20)*MIN(ABS(H20),ABS(H10)),IF((H13+H14)>0,H10,0))","v":1.5703417840588616},{"$f":"IF(I16>0,SIGN(I20)*MIN(ABS(I20),ABS(I10)),IF((I13+I14)>0,I10,0))","v":1.6174613251662047},1.6407517805861576,1.6302614634867096,1.5901572328344264,1.5360796393390028,1.4008529736008679,1.221103064563779,1.1312848489761074]
[null,null,null,null,{"$f":"E2/E6","v":0.52173913043478259},{"$f":"F2/F6","v":0.44871794871794873},{"$f":"G2/G6","v":0.40322580645161288},{"$f":"H2/H6","v":0.41614906832298132},{"$f":"I2/I6","v":0.38235294117647062},0.3644444444444444,0.30327868852459022,0.3316831683168317,0.36734693877551022,0.42391304347826092,0.490566037735849,0.48837209302325574]
["Irraggiamento extratmosferico",null,"Hho","MJ/m2",{"$f":"24*3600/1000000/PI()*Ics*(1+0.033*COS(360*E5/365/180*PI()))*(E11*2*PI()*E9/360+E12*SIN(E10))","v":12.007952135572813},{"$f":"24*3600/1000000/PI()*Ics*(1+0.033*COS(360*F5/365/180*PI()))*(F11*2*PI()*F9/360+F12*SIN(F10))","v":17.446513392807713},{"$f":"24*3600/1000000/PI()*Ics*(1+0.033*COS(360*G5/365/180*PI()))*(G11*2*PI()*G9/360+G12*SIN(G10))","v":24.791915859805336},{"$f":"24*3600/1000000/PI()*Ics*(1+0.033*COS(360*H5/365/180*PI()))*(H11*2*PI()*H9/360+H12*SIN(H10))","v":32.819740145360996},{"$f":"24*3600/1000000/PI()*Ics*(1+0.033*COS(360*I5/365/180*PI()))*(I11*2*PI()*I9/360+I12*SIN(I10))","v":38.783697010922978},41.323984574917141,40.019386423480512,35.101543730913761,27.663650776553919,19.578586834541763,13.26663869953849,10.572371178628234]
["Irraggiamento diretto sull'orizzontale extratm.",null,"Hbh","W/m2",{"$f":"2*Ics*(E11*E10+E12*SIN(E10))","v":846.49617255678754},1240.4931306213375,1786.6405588026632,2405.3318318594438,2885.5551143358339,3101.1980691088415,3005.9790368525832,2613.7786731853766,2029.6956453417472,1412.4753777788228,943.29301234464015,745.82310057849793]
["Irraggiamento diretto sulla superficie extratmos.",null,"Hb","W/m2",{"$f":"Ics*(E13*(E22-E21)+E14*(SIN(E22)-SIN(E21))-E15*(COS(E22)-COS(E21)))","v":1956.80170154705},2264.2297332248395,2560.2430562970239,2761.0919547149665,2840.172820180258,2853.0619184560155,2849.1633396874372,2803.6948976998397,2653.5948678313011,2372.0739418916764,2041.1788210266411,1861.6852238324623]
["Rapporto di irraggiamento diretto",null,"Rb",null,{"$f":"E26/E25","v":2.3116486110464689},1.8252658377001518,1.4329927996332956,1.1479047997217506,0.9842725949228589,0.9199870033699169,0.9478320722657666,1.0726596427091566,1.3073856043005432,1.6793736579124394,2.1638862944114328,2.4961485134858998]
["Indice di soleggiamento",null,"KT",null,{"$f":"E6/E24","v":0.38307947500663209},{"$f":"F6/F24","v":0.44708073323209285},{"$f":"G6/G24","v":0.50016303984412458},{"$f":"H6/H24","v":0.49055842394522142},{"$f":"I6/I24","v":0.52599420819151343},0.54447798854462515,0.60970450025900014,0.57547326564472312,0.53138322626812706,0.46990112604903567,0.39949832960962245,0.40672049130211546]
["Frazione diffusa del soleggiamento",null,"Hd/Hh",null,{"$f":"E2/E6","v":0.52173913043478259},{"$f":"F2/F6","v":0.44871794871794873},{"$f":"G2/G6","v":0.40322580645161288},{"$f":"H2/H6","v":0.41614906832298132},{"$f":"I2/I6","v":0.38235294117647062},0.3644444444444444,0.30327868852459022,0.3316831683168317,0.36734693877551022,0.42391304347826092,0.490566037735849,0.48837209302325574]
["Rapporto di irraggiamento globale",null,"R",null,{"$f":"(1-E29)*E27+E29*(1+COS(beta))/2+E4*(1-COS(beta))/2","v":1.6070975162018766},1.4396330464469711,1.2461251270956057,1.073214859003732,0.97941042964191449,0.93947135241509006,0.95807487863782881,1.0410783085169535,1.1845980702240546,1.3777187190962752,1.5747987187593042,1.7474938110820004]
["Irraggiamento medio mensile giornaliero",null,"H","MJ/m2",{"$f":"E30*E6","v":7.3926485745286321},11.229137762286374,15.451951575985511,17.278759229960087,19.979972764695056,21.138105429339525,23.377027038763021,21.02978183204246,17.413591632293603,12.675012215685731,8.3464332094243137,7.5142233876526028]
["Giorni al mese",null,null,null,31,28,31,30,31,30,31,31,30,31,30,31]
["Radiazione totale mensile",null,null,"MJ/m2",{"$f":"E32*E31","v":229.17210581038759},{"$f":"F32*F31","v":314.41585734401849},479.01049885555085,518.36277689880262,619.37915570554674,634.14316288018574,724.68783820165368,651.92323679331628,522.40774896880805,392.92537868625766,250.3929962827294,232.94092501723068]
[null,null,null,"kWh/m2",{"$f":"E33/3.6","v":63.658918280663215},{"$f":"F33/3.6","v":87.337738151116241},133.05847190431967,143.98966024966739,172.04976547376299,176.15087857782936,201.30217727823714,181.08978799814341,145.11326360244666,109.14593852396045,69.553610078535939,64.705812504786294]
["Totale annuo",null,null,"MJ/m2",{"$f":"SUM(E33:P33)","v":5569.7616814444873}]
[null,null,null,"kWh/m2",{"$f":"E35/3.6","v":1547.1560226234687}]
["Temperature medie",null,null,"°",{"$f":"VLOOKUP(Tabelle2!localitàscelta,'Tabelle UNI'!A5:P105,5)","v":1.5},{"$f":"VLOOKUP(Tabelle2!localitàscelta,'Tabelle UNI'!A5:P105,6)","v":4.2},{"$f":"VLOOKUP(Tabelle2!localitàscelta,'Tabelle UNI'!A5:P105,7)","v":9.3000000000000007},{"$f":"VLOOKUP(Tabelle2!localitàscelta,'Tabelle UNI'!A5:P105,8)","v":13.5},{"$f":"VLOOKUP(Tabelle2!localitàscelta,'Tabelle UNI'!A5:P105,9)","v":17.7},{"$f":"VLOOKUP(Tabelle2!localitàscelta,'Tabelle UNI'!A5:P105,10)","v":22},{"$f":"VLOOKUP(Tabelle2!localitàscelta,'Tabelle UNI'!A5:P105,11)","v":24.4},{"$f":"VLOOKUP(Tabelle2!localitàscelta,'Tabelle UNI'!A5:P105,12)","v":23.7},{"$f":"VLOOKUP(Tabelle2!localitàscelta,'Tabelle UNI'!A5:P105,13)","v":19.899999999999999},{"$f":"VLOOKUP(Tabelle2!localitàscelta,'Tabelle UNI'!A5:P105,14)","v":14},{"$f":"VLOOKUP(Tabelle2!localitàscelta,'Tabelle UNI'!A5:P105,15)","v":7.8},{"$f":"VLOOKUP(Tabelle2!localitàscelta,'Tabelle UNI'!A5:P105,16)","v":3.5}]
[]
["Angolo all'apparire del sole sulla superficie",null,"w'",null,{"$f":"E21/PI()*180","v":-67.529845549502454},-76.700933650600049,-87.580109777979487,-95.147462815522729,-97.847213653566683,-99.18165845206758,{"$f":"K21/3.1415*180","v":-98.583515036118712},-96.285644109042153,-92.221267905707407,-80.265330335239923,-69.9661154294064,-64.819758973642948]
["Angolo allo scomparire del sole sulla superficie",null,"w''",null,{"$f":"E22/3.1415*180","v":67.531837235833294},{"$f":"F22/3.1415*180","v":76.703195823715831},86.763963397497079,89.976610259619633,92.676440722558269,94.010924878404694,93.409856255803831,91.111985328727272,88.013476072265007,80.265330335239923,69.9661154294064,64.819758973642948]
["Irraggiamento diretto sulla superficie",null,"KT  Hb","W/m2",{"$f":"E46","v":228.0639612852039},{"$f":"F46","v":304.99879090517044},369.28775606730812,388.90042191115145,436.95302188154437,455.89451608633544,507.33147021038434,467.58377483073554,{"$f":"M46","v":402.56739738310898},328.98731418727857,248.52605311750276,241.51018617602512]
["Angoli app/scomp rispetto perpen. coll.",null,"a",null,{"$f":"IF(E39-(gamma/PI()*180)<-90,-90,E39-(gamma/PI()*180))","v":-62.529845549502454},{"$f":"IF(F39-(gamma/PI()*180)<-90,-90,F39-(gamma/PI()*180))","v":-71.700933650600049},-82.580109777979487,-90,-90,-90,-90,-90,-87.221267905707407,-75.265330335239923,-64.9661154294064,-59.819758973642948]
[null,null,"b",null,{"$f":"IF((E40-gamma/PI()*180)>90,90,(E40-gamma/PI()*180))","v":72.531837235833294},{"$f":"IF((F40-gamma/PI()*180)>90,90,(F40-gamma/PI()*180))","v":81.703195823715831},90,90,90,90,90,90,90,{"$f":"IF((N40-gamma/PI()*180)>90,90,(N40-gamma/PI()*180))","v":85.265330335239923},74.9661154294064,69.819758973642948]
["Ora alba",null,null,null,{"$f":"E39/15+12","v":7.4980102966998361},6.8866044232933303,6.1613260148013671,5.6568358122984845,5.4768524230955542,5.3878894365288277,5.4277656642587528,{"$f":"L39/15+12","v":5.58095705939719},5.8519154729528395,6.6489779776506719,7.3355923047062399,7.6786827350904705]
["Ora tramonto",null,null,null,{"$f":"E40/15+12","v":16.502122482388884},{"$f":"F40/15+12","v":17.113546388247723},17.784264226499804,17.998440683974643,18.178429381503886,18.267394991893646,18.227323750386923,18.074132355248484,17.867565071484336,17.351022022349326,16.664407695293761,16.321317264909531]
["Irraggiamento (energia/ore)",null,null,"W/m2 g",{"$f":"E31/3.6*1000/E47","v":228.0639612852039},304.99879090517044,369.28775606730812,388.90042191115145,436.95302188154437,455.89451608633544,507.33147021038434,467.58377483073554,402.56739738310898,328.98731418727857,248.52605311750276,241.51018617602512]
["ore di irraggiamento",null,null,null,{"$f":"12-E44+E45-12","v":9.0041121856890491},10.226941964954392,11.622938211698436,12.341604871676157,12.701576958408332,12.879505555364819,12.799558086128169,12.493175295851294,12.015649598531496,10.702044044698653,9.328815390587522,8.6426345298190625]
[]
[]
[null,null,null,"diretta",{"$f":"(1-E29)*E27*E28*E24","v":5.0856269443022306},{"$f":"(1-F29)*F27*F28*F24","v":7.8486431021106542},10.604146717286389,10.790305117384458,12.401834696028022,13.155814148189814,16.113145228518032,{"$f":"(1-L29)*L27*L28*L24","v":14.480905176573614},{"$f":"(1-M29)*M27*M28*M24","v":12.158686119995053},{"$f":"(1-N29)*N27*N28*N24","v":8.9006803869359263},{"$f":"(1-O29)*O27*O28*O24","v":5.842492994910871},{"$f":"(1-P29)*P27*P28*P24","v":5.4915267296689807}]
[null,null,null,"diffusa",{"$f":"E29*(1+COS(beta))/2*E28*E24","v":2.2392304845413262},{"$f":"F29*(1+COS(beta))/2*F28*F24","v":3.2655444566227683},4.6650635094610964,6.2511851026778702,7.2774990747593113,7.6507041555161992,6.9042939940024253,{"$f":"L29*(1+COS(beta))/2*L28*L24","v":6.2511851026778693},{"$f":"M29*(1+COS(beta))/2*M28*M24","v":5.0382685902179851},{"$f":"N29*(1+COS(beta))/2*N28*N24","v":3.6387495373796561},{"$f":"O29*(1+COS(beta))/2*O28*O24","v":2.4258330249197706},{"$f":"P29*(1+COS(beta))/2*P28*P24","v":1.959326673973661}]
[null,null,null,"riflessa",{"$f":"E4*(1-COS(beta))/2*E28*E24","v":6.7791145685074009E-2},{"$f":"F4*(1-COS(beta))/2*F28*F24","v":0.1149502035529516},0.1827413492380256,0.23726900989775906,0.30063899390771948,0.33158712563351422,0.35958781624256653,{"$f":"L4*(1-COS(beta))/2*L28*L24","v":0.2976915527909772},{"$f":"M4*(1-COS(beta))/2*M28*M24","v":0.21663692208056262},{"$f":"N4*(1-COS(beta))/2*N28*N24","v":0.13558229137014802},{"$f":"O4*(1-COS(beta))/2*O28*O24","v":7.8107189593672244E-2},{"$f":"P4*(1-COS(beta))/2*P28*P24","v":6.3369984009960509E-2}]

{"sheet":"ammortamento","index":11,"n_rows":26,"n_cols":8,"rows_kept":26,"cut":false,"hidden":false,"merged":[[19,2,20,10],[23,2,24,10],[6,7,6,8],[13,7,13,8]]}
[]
[]
[]
[]
[]
[null,null,"Costo stimato impianto:",null,null,null,null,"Costo annuo manutenz. [euro]:"]
[null,null,7000,"€",null,null,null,0]
[]
[]
[]
[null,null,"Contributi / sgravi fiscali:"]
[null,null,{"$f":"+incentivi!E47","v":4108.7999999999993},"€"]
[null,null,null,null,null,null,null,"Investimento netto [euro]:"]
[null,null,null,null,null,null,null,{"$f":"+costo2-C12","v":2891.2000000000007}]
[]
[null,null,"Il vostro investimento vi permetterà di risparmiare da subito:"]
[null,null,{"$f":"+Tabelle6!E20","v":766},{"$f":"+Tabelle6!F20&\" per il primo anno;\"","v":"m3 di metano per il primo anno;"}]
[null,null,{"$f":"+Tabelle6!E21","v":651.1},"euro il primo anno di esercizio impianto."]
[]
[null,null,"Tenuto conto del tasso di aumento del combustibile, la tabella a lato vi fornisce un riepilogo dell'investimento durante la vita stimata dell'impianto solare."]
[]
[null,null,{"$f":"IF(tasso=0,(H14)/(C18-manut),LOG(1+tasso/100*(H14)/(C18-manut),1+tasso/100))","v":4.1685869835422684},"anni per ammortizzare l'investimento"]
[]
[null,null,"Considerando una vita media dell'impianto pari a 20 anni, il vostro investimento in un impianto solare vi permetterà di guadagnare circa:"]
[]
[null,null,{"$f":"+cashflow!M39","v":17246.803239155553},"euro"]

{"sheet":"cti_show","index":12,"n_rows":49,"n_cols":12,"rows_kept":49,"cut":false,"hidden":false,"merged":[[48,3,48,10]]}
[]
[]
[]
[null,null,null,"Calcolo energia primaria per produzione A.C.S. (secondo UNI TS 11300-5)"]
[]
[null,null,null,"Rendimenti considerati:"]
[]
[null,null,null,"h w,er","- Rendimento di erogazione",null,null,{"$f":"+cti!E2","v":1}]
[null,null,null,"h w,d","- Rendimento di distribuzione",null,null,{"$f":"+cti!F7","v":0.92},"(Ricircolo assente; se presente, vedi sotto)"]
[null,null,null,"h w,c","- Rendimento di generazione",null,null,{"$f":"+cti!E16","v":0.9},{"$f":"+\"(\"&Tabelle6!B10&\")\"","v":"(Caldaia a condens. 4*)"}]
[]
[null,null,null,"Per le dispersioni della rete di ricircolo, si sono considerati i seguenti valori:"]
[]
[null,null,null,"Coefficiente dispersione tubazione:",null,null,null,{"$f":"+IF(Tabelle5!C36=FALSE,\"-\",+k_ricircolo)","v":0.4},"W/mK"]
[null,null,null,"Lunghezza semplice rete ricircolo:",null,null,null,{"$f":"+IF(Tabelle5!C36=FALSE,\"-\",+lung_ricircolo)","v":10},"m"]
[null,null,null,"Ore di funzionamento ricircolo al giorno:",null,null,null,{"$f":"+IF(Tabelle5!C36=FALSE,\"-\",+ore_ricircolo)","v":6},"ore / giorno"]
[null,null,null,"Temperatura distribuzione ACS:",null,null,null,{"$f":"+IF(Tabelle5!C36=FALSE,\"-\",+tdistrib_ricircolo)","v":48},"°C"]
[null,null,null,"Temperatura ambiente tubazione ricircolo:",null,null,null,{"$f":"+IF(Tabelle5!C36=FALSE,\"-\",+tamb_ricircolo)","v":18.4583333333333},"°C"]
[]
[null,null,null,"Per le dispersioni dell'accumulo solare:"]
[]
[null,null,null,{"$f":"\"Tipologia: \"& IF(sceltobollitore=FALSE,bollitore!B58,\"bollitore di altra marca:\")","v":"Tipologia: Aqua Expresso III 500"},null,null,null,{"$f":"+IF(sceltobollitore=TRUE,spessoreisolam,\"\")","v":""},{"$f":"+IF(sceltobollitore=TRUE,\"mm di isolamento\",\"\")","v":""}]
[null,null,null,null,null,null,null,{"$f":"+IF(sceltobollitore=TRUE,conducibilita,\"\")","v":""},{"$f":"+IF(sceltobollitore=TRUE,\"W/mk di dispersione termica\",\"\")","v":""}]
[null,null,null,"Riepilogo:"]
[null,null,null,null,"(1) energia utile per ACS",null,null,null,null,"Q h,w",{"$f":"+cti!E31","v":11264.651967592592},"kWh"]
[null,null,null,null,"(2) perdite per distribuzione e ricircolo",null,null,null,null,"Q l,w,d",{"$f":"+cti!H31+cti!F31","v":1159.9571574074075},"kWh"]
[null,null,null,null,"(3) perdite per erogazione",null,null,null,null,"Q l,w,er",{"$f":"+cti!G31","v":0},"kWh"]
[null,null,null,null,"(4) perdite di accumulo",null,null,null,null,"Q l,w,s",{"$f":"+cti!I31","v":637.72800000000007},"kWh"]
[null,null,null,null,"TOTALE ENERGIA DA FORNIRE",null,null,null,null,"Q w,gn, out",{"$f":"SUM(K25:K28)","v":13062.337124999998},"kWh"]
[null,null,null,null,"di cui, ","da solare:",null,null,null,null,{"$f":"+cti!K31","v":6552.549699706},"kWh"]
[null,null,null,null,null,"da combustibile generatore:",null,null,null,null,{"$f":"+cti!M31","v":6509.7874252940001},"kWh"]
[null,null,null,null,null,{"$f":"IF(cti!H14=TRUE,\"da aria:\",\"\")","v":""},null,null,null,null,{"$f":"IF(cti!H14=TRUE,cti!L31,\"\")","v":""},{"$f":"IF(cti!H14=TRUE,\"kWh\",\"\")","v":""}]
[]
[null,null,null,null,"Energia consumata da generatore tradizionale:",null,null,null,null,"Q w,gn, in",{"$f":"+cti!M31+cti!N31","v":7233.0971392155552},"kWh"]
[null,null,null,null,"Energia elettrica ausiliari (pompa solare e carico bollitore)",null,null,null,null,"Q w,aux",{"$f":"+cti!Q31+cti!O31","v":163.52774599128395},"kWh"]
[]
[null,null,null,"Fattori di conversione energia primaria:",null,null,null,null,"fp,tot","fp,nren","fp,ren"]
[null,null,null,null,"Vettore energetico generatore tradizionale",null,null,null,{"$f":"+cti!T13","v":1.05},{"$f":"+cti!U13","v":1.05},{"$f":"+cti!V13","v":0}]
[null,null,null,null,"Energia elettrica per ausiliari",null,null,null,{"$f":"+cti!T12","v":2.42},{"$f":"+cti!U12","v":1.95},{"$f":"+cti!V12","v":0.47}]
[]
[null,null,null,"Copertura rinnovabile fabbisogno energia primaria ACS:",null,null,null,null,"Ep,tot","Ep,nren","Ep,ren"]
[null,null,null,null,"Vettore energetico generaotre tradizionale",null,null,null,{"$f":"+K34*I38","v":7594.7519961763337},{"$f":"+K34*J38","v":7594.7519961763337},{"$f":"+K34*K38","v":0}]
[null,null,null,null,"Vettore energia elettrica per ausiliari",null,null,null,{"$f":"+K35*I39","v":395.73714529890714},{"$f":"+K35*J39","v":318.87910468300367},{"$f":"+K35*K39","v":76.858040615903448}]
[null,null,null,null,"Vettore energetico solare",null,null,null,{"$f":"+K30","v":6552.549699706},0,{"$f":"+K30","v":6552.549699706}]
[null,null,null,null,{"$f":"IF(cti!H14=TRUE,\"Vettore energetico aria:\",\"\")","v":""},null,null,null,{"$f":"IF(cti!H14=TRUE,cti!L31,\"\")","v":""},{"$f":"IF(cti!H14=TRUE,0,\"\")","v":""},{"$f":"IF(cti!H14=TRUE,cti!L31,\"\")","v":""}]
[null,null,null,null,null,null,null,null,{"$f":"SUM(I42:I45)","v":14543.038841181242},{"$f":"SUM(J42:J45)","v":7913.6311008593375},{"$f":"SUM(K42:K45)","v":6629.4077403219035}]
[]
[null,null,null,null,"Quota copertura rinnovabili per acs QR:",null,null,null,"QR = Ep,ren","/ Ep,tot",{"$f":"+K46/I46","v":0.45584748914714701}]
[null,null,null,"Nel calcolo, sono state considerate trascurabili le perdite di calore\ndel circuito caldaia-bollitore (lungh. < 5 m ed isolate, secondo 6.9.4 UNI-TS).\nLe perdite di calore si considerano non recuperate.\nNel calcolo dell'energia primaria, non viene considerato il consumo elettrico della pompa ricircolo."]

{"sheet":"relazione_amm","index":13,"n_rows":39,"n_cols":10,"rows_kept":39,"cut":false,"hidden":false,"merged":[[38,2,40,11],[34,3,35,10],[6,5,6,9],[7,5,7,9],[9,5,9,6]]}
[]
[]
[]
[null,null,null,"Simulazione impianto solare"]
[null,null,null,"Foglio previsione ammortamento"]
[]
[null,null,null,"Committente:",null,{"$f":"+Dati!E6","v":0}]
[null,null,null,"Riferimento:",null,{"$f":"+Dati!E8","v":0}]
[]
[null,null,null,"Data:",null,{"$f":"+TODAY()","v":"2018-01-29"}]
[]
[null,null,null,"Dati generali"]
[null,null,null,"Località e dati climatici:",null,null,null,null,{"$f":"+Dati!N6","v":"Brescia"}]
[null,null,null,"Tipologia collettori:",null,null,null,null,{"$f":"+Dati!E11","v":"AQUA PLASMA"}]
[null,null,null,"Superficie collettori:",null,null,null,null,{"$f":"+superficie","v":8},"m2"]
[null,null,null,"Inclinazione:",null,null,null,null,{"$f":"+Dati!E13","v":30},"°"]
[null,null,null,"Azimut:",null,null,null,null,{"$f":"+Dati!N13","v":-5},"°"]
[]
[null,null,null,"Risultati solari:"]
[null,null,null,"Fornitura energia solare:",null,null,null,null,{"$f":"+pr_disp","v":6552.549699706},"kWh / anno"]
[null,null,null,{"$f":"+riepilogo!C23","v":"Resa dell'impianto solare:"},null,null,null,null,{"$f":"+riepilogo!F23","v":819.06871246324999},"kWh/m2 anno"]
[]
[null,null,null,"Foglio economico:"]
[null,null,null,"Costo stimato dell'investimento:",null,null,null,null,{"$f":"+costo2","v":7000},"euro"]
[null,null,null,"Sgravi / Contributi:",null,null,null,null,{"$f":"+ammortamento!C12","v":4108.7999999999993},"euro"]
[null,null,null,"Costo annuo manutenzione:",null,null,null,null,{"$f":"+manut","v":0},"euro"]
[null,null,null,"Valore da ammortizzare:",null,null,null,null,{"$f":"+ammortamento!H14","v":2891.2000000000007},"euro"]
[]
[null,null,null,"Sulla base dei dati inseriti, l'investimento permetterà di risparmiare:"]
[null,null,null,{"$f":"+Tabelle6!E20","v":766},{"$f":"+Tabelle6!F20&\" di \"&Tabelle6!E10&\", pari a:\"","v":"m3 di metano di metano, pari a:"}]
[null,null,null,{"$f":"+Tabelle6!E21","v":651.1},"euro nel primo anno di esercizio."]
[]
[null,null,null,"Ammortamento impianto solare:",null,null,null,null,{"$f":"+ammortamento!C22","v":4.1685869835422684},"anni"]
[]
[null,null,null,"Considerando una vita media dell'impianto pari a 20 anni, l'investimento in un impianto solare permetterà di guadagnare circa:"]
[]
[null,null,null,null,null,null,null,null,{"$f":"+cashflow!M39","v":17246.803239155553},"euro"]
[]
[null,null,"Non sono considerati i fenomeni di ombreggiamento e/o di ostruzione ai raggi solari dati \nda ostacoli presenti in sito o dal profilo orografico circostante.\nParadigma non fornisce alcuna garanzia, né esplicita né implicita e non si assume alcuna responsabilità \nper i dati forniti dalla presente simulazione. Essi sono puramente indicativi e soggetti a calcolo più dettagliato. \nParadigma non garantisce l'uso del software in tutte le situazioni. "]

{"sheet":"cashflow","index":14,"n_rows":39,"n_cols":23,"rows_kept":39,"cut":false,"hidden":true,"merged":[]}
[]
[]
[]
[]
[]
[]
[]
[]
[]
[]
[]
[]
[]
[]
[]
[]
[]
[]
[null,null,"Anno",1,2,3,4,5,6,7,8,9,10]
[null,null,"Costi attualizz. (manutenzione)",{"$f":"manut*(1+tasso/100)^D19","v":0},0,0,0,0,0,0,0,0,0]
[null,null,"Risparmi  combust. (attualizz.)",{"$f":"+ammortamento!$C$18","v":651.1},{"$f":"$D$21*(1+tasso/100)^E19","v":704.22976000000006},732.3989504000001,761.6949084160002,792.16270475264025,823.84921294274591,856.80318146045568,891.075308718874,926.71832106762906,963.78705391033418]
[null,null,"Risparmio netto R-C",{"$f":"D21-D20","v":651.1},704.22976000000006,732.3989504000001,761.6949084160002,792.16270475264025,823.84921294274591,856.80318146045568,891.075308718874,926.71832106762906,963.78705391033418]
[]
[null,null,"Risparmio cumul.",{"$f":"D22","v":651.1},{"$f":"D24+E22","v":1355.3297600000001},2087.7287104000002,2849.4236188160003,3641.5863235686406,4465.4355365113861,5322.2387179718417,6213.3140266907158,7140.0323477583452,8103.8194016686793]
[null,null,"Detrazioni",{"$f":"+incentivi!E35","v":2054.3999999999996},{"$f":"+incentivi!E36","v":2054.3999999999996},{"$f":"+incentivi!E37","v":0},{"$f":"+incentivi!E38","v":0},{"$f":"+incentivi!E39","v":0},{"$f":"+incentivi!E40","v":0},{"$f":"+incentivi!E41","v":0},{"$f":"+incentivi!E42","v":0},{"$f":"+incentivi!E43","v":0},{"$f":"+incentivi!E44","v":0}]
[null,null,"Detrazioni cumul.",{"$f":"+D25","v":2054.3999999999996},{"$f":"+D26+E25","v":4108.7999999999993},4108.7999999999993,4108.7999999999993,4108.7999999999993,4108.7999999999993,4108.7999999999993,4108.7999999999993,4108.7999999999993,4108.7999999999993]
[]
[null,null,"Pay back",{"$f":"(-costo2)+D24+D26","v":-4294.5},-1535.8702400000002,-803.47128960000009,-41.776381184000456,750.38632356863991,1574.2355365113854,2431.0387179718409,3322.114026690715,4248.8323477583444,5212.6194016686786,{"$f":"+D39","v":6214.9579377354257},7257.3900152448441,8341.5193758546375,9469.0139108888234,10641.608227324377,11861.106316417354,13129.384329074048,14448.393462237011,15820.162960726491,17246.803239155553]
[]
[null,null,"Anno",11,12,13,14,15,16,17,18,19,20]
[null,null,"Costi attualizz. (manutenzione)",{"$f":"manut*(1+tasso/100)^D30","v":0},0,0,0,0,0,0,0,0,0]
[null,null,"Risparmi  combust. (attualizz.)",{"$f":"$D$21*(1+tasso/100)^D30","v":1002.3385360667475},1042.4320775094177,1084.1293606097943,1127.4945350341861,1172.5943164355535,1219.4980890929758,1268.278012656695,1319.0091331629628,1371.7694984894813,1426.6402784290606]
[null,null,"Risparmio netto R-C",{"$f":"D32-D31","v":1002.3385360667475},1042.4320775094177,1084.1293606097943,1127.4945350341861,1172.5943164355535,1219.4980890929758,1268.278012656695,1319.0091331629628,1371.7694984894813,1426.6402784290606]
[]
[null,null,"Risparmio cumul.",{"$f":"M24+D33","v":9106.1579377354265},{"$f":"D35+E33","v":10148.590015244845},11232.719375854638,12360.213910888824,13532.808227324378,14752.306316417355,16020.584329074049,17339.593462237011,18711.362960726492,20138.003239155554]
[null,null,"Detrazioni"]
[null,null,"Detrazioni cumul.",{"$f":"+M26+D36","v":4108.7999999999993},{"$f":"+D37+E36","v":4108.7999999999993},4108.7999999999993,4108.7999999999993,4108.7999999999993,4108.7999999999993,4108.7999999999993,4108.7999999999993,4108.7999999999993,4108.7999999999993]
[]
[null,null,"Pay back",{"$f":"(-costo2)+D35+D37","v":6214.9579377354257},7257.3900152448441,8341.5193758546375,9469.0139108888234,10641.608227324377,11861.106316417354,13129.384329074048,14448.393462237011,15820.162960726491,17246.803239155553]

{"sheet":"incentivi","index":15,"n_rows":47,"n_cols":10,"rows_kept":47,"cut":false,"hidden":true,"merged":[]}
[]
[]
[null,null,null,null,"% sgravio","massimale incentivo","testo1","testo2","> 50 m2","< 50 m2"]
[null,null,1,"Detrazioni fiscali per efficienza energetica (65%)",65,60000,"Detrazioni fiscali = 65%","Valore massimo detrazione = 60.000 € in 10 rate annuali."]
[null,null,2,"Detrazioni fiscali per ristrutturazione (50%)",50,48000,"Detrazioni fiscali = 50%","Valore massimo detrazione = 48.000 € in 10 rate annuali."]
[null,null,3,"Conto energia 2.0 per ACS",null,null,"nel caso di Plasma, calcolo effettuato con AP 15/40 - nel caso di Star, con Star 15/39","il calcolo è approssimato nel caso in cui la superficie inserita non sia multriplo esatto",55,170]
[null,null,4,"Conto energia 2.0 per ACS, riscaldamento",null," ","nel caso di Plasma, calcolo effettuato con AP 15/40 - nel caso di Star, con Star 15/39","il calcolo è approssimato nel caso in cui la superficie inserita non sia multriplo esatto",83,255]
[null,null,5,"Conto energia 2.0 per calore di processo",null,null,"nel caso di Plasma, calcolo effettuato con AP 15/40 - nel caso di Star, con Star 15/39","il calcolo è approssimato nel caso in cui la superficie inserita non sia multriplo esatto"]
[null,null,6,"Conto energia 2.0 per solar cooling",null,null,"nel caso di Plasma, calcolo effettuato con AP 15/40 - nel caso di Star, con Star 15/39","il calcolo è approssimato nel caso in cui la superficie inserita non sia multriplo esatto"]
[null,null,7,"Altro",null,null,"Immettere il valore del contributo in €"," "]
[null,null,3,{"$f":"+VLOOKUP(C11,C4:H10,2,FALSE)","v":"Conto energia 2.0 per ACS"},{"$f":"+VLOOKUP(C11,C4:H10,3,FALSE)","v":0},{"$f":"+VLOOKUP(C11,C4:H10,4,FALSE)","v":0},{"$f":"+VLOOKUP(C11,C4:H10,5,FALSE)","v":"nel caso di Plasma, calcolo effettuato con AP 15/40 - nel caso di Star, con Star 15/39"},{"$f":"+VLOOKUP(C11,C4:H10,6,FALSE)","v":"il calcolo è approssimato nel caso in cui la superficie inserita non sia multriplo esatto"},{"$f":"+VLOOKUP(C11,C4:J10,7,FALSE)","v":55},{"$f":"+VLOOKUP(C11,C4:J10,8,FALSE)","v":170}]
[]
[null,null,0,"valore inserito dall'utente nel caso di altro"]
[]
[]
[null,"m2",{"$f":"+superficie","v":8}]
[]
[null,"Calcolo incentivo per conto termico (dal foglio CT20)"]
[null,null,null,"totale incentivo","anni","rata"]
[null,"Considerata superficie:",null,{"$f":"+'CT20'!E25","v":4108.7999999999993},{"$f":"+'CT20'!E24","v":2},{"$f":"+D20/E20","v":2054.3999999999996}]
[]
[]
[]
[null,null,{"$f":"+costo2","v":7000},"spesa inserita"]
[]
[null,"Calcolo incentivo detrazioni fiscali"]
[null,null,{"$f":"+C24*E11/100","v":0},"detrazioni da %"]
[null,null,{"$f":"+IF(C27<F11,C27,F11)","v":0},"detrazioni da utilizzare (limitate superiormente)"]
[]
[]
[]
[null,"Riepilogo rata"]
[]
[null,"anno","rata conto energia","rata detrazioni","rata da usare nell'ammortamento"]
[null,1,{"$f":"+IF(B35<=$E$20,$F$20,0)","v":2054.3999999999996},{"$f":"+$C$28/10","v":0},{"$f":"+IF(OR($C$11=1,$C$11=2),D35,IF(OR($C$11=3,$C$11=4,$C$11=5,$C$11=6),C35,IF($C$11=7,$C$13,0)))","v":2054.3999999999996}]
[null,2,{"$f":"+IF(B36<=$E$20,$F$20,0)","v":2054.3999999999996},{"$f":"+$C$28/10","v":0},{"$f":"+IF(OR($C$11=1,$C$11=2),D36,IF(OR($C$11=3,$C$11=4,$C$11=5,$C$11=6),C36,IF($C$11=7,0,0)))","v":2054.3999999999996}]
[null,3,0,0,{"$f":"+IF(OR($C$11=1,$C$11=2),D37,IF(OR($C$11=3,$C$11=4,$C$11=5,$C$11=6),C37,IF($C$11=7,0,0)))","v":0}]
[null,4,0,0,0]
[null,5,0,0,0]
[null,6,0,0,0]
[null,7,0,0,0]
[null,8,0,0,0]
[null,9,0,0,0]
[null,10,0,0,0]
[null,null,{"$f":"SUM(C35:C44)","v":4108.7999999999993},{"$f":"SUM(D35:D44)","v":0},{"$f":"SUM(E35:E44)","v":4108.7999999999993}]
[]
[null,null,null,"valore da mostrare nel foglio AMMORTAMENTO:",{"$f":"+IF(incentivoutente>0,incentivoutente,E45)","v":4108.7999999999993}]

{"sheet":"cti","index":16,"n_rows":60,"n_cols":33,"rows_kept":60,"cut":false,"hidden":true,"merged":[]}
[]
["erogazione","eta,w,er",null,null,1,"Valore precedente pari a 0,95 ed ora aggiornato a 1 secondo 11300 del 2014"]
[]
[null,null,null,"descrizione","f l,d,w"]
["distribuzione","eta, w,d",0,"Sistemi installati prima dell'entrata in vigore della legge 373/76",0.12]
[null,null,1,"Sistemi installati dopo dell'entrata in vigore della legge 373/76",0.08]
[null,null,1,{"$f":"+VLOOKUP(C7,C5:E6,2)","v":"Sistemi installati dopo dell'entrata in vigore della legge 373/76"},{"$f":"+VLOOKUP(C7,C5:E6,3)","v":0.08},{"$f":"1-E7","v":0.92},null,null,null,null,null,null,null,null,null,null,null,null,"potenza elettrica caldaia per acs",0.1,"kW"]
[]
[null,null,null,null,null,null,null,null,null,null,null,null,null,null,null,null,null,null,"temperatura bollitore per calcolo dispersioni termiche secondo UNITS 11300/4",60]
[null,null,null,null,"?"]
[null,null,null,null,null,null,null,null,null,null,null,null,null,null,null,null,null,null,null,"fp tot","fp nren","fp ren"]
[null,null,null,null,null,null,null,null,null,null,null,null,null,null,"conversione energia elettrica in primaria",null,null,null,null,2.42,1.95,0.47,"vedi decreto di agosto 2015"]
[null,null,null,null,null,null,"ricircolo_sino",{"$f":"+ricircolo_sino","v":true},null,null,null,null,null,null,"conversione energia primaria comnbustibile ",null,null,null,null,{"$f":"+Tabelle6!L10","v":1.05},{"$f":"+Tabelle6!N10","v":1.05},{"$f":"+Tabelle6!O10","v":0},"(da Tabelle6)",null,null,null,"Fabbisogno elettrico solare"]
[null,null,null,null,null,null,"generatore prinicpale PDC?",{"$f":"+Tabelle6!P10","v":false}]
[null,null,null,null,null,null,null,null,null,null,null,null,null,null,null,null,null,null,null,null,null,null,null,null,null,null,"Waux,nom",{"$f":"50+5*superficie","v":90},"Watt",null,"Aquasys"]
["combustione","eta, c",null,"Rendimento per ACS",{"$f":"+Tabelle6!D11/100","v":0.9},"dal foglio \"tabelle 6\" (nel caso di PDC, trattasi di COPN 55/7*C)",null,null,null,null,null,null,null,null,null,null,null,"energia",null,null,null,null,null,null,null,null,null,null,null,null,"taux,w,m"]
[null,null,null,null,null,null,null,null,"storage",null,"di cui",null,null,"perdite",null,"h caldaia acs","Qaux,gn,W","primaria",null,null,null,null,"hwh = hwh,calc x 0,95 = f x COPN x 0,95",null,null,null,null,"Isol / Isol tot","ore/mese","taux,w,m",{"$f":"+aquasys","v":true},"nel caso di sistema Aqua, le ore di funzionamento vengono diminuite al 46,2% (vedi UT 05/2008)"]
[null,null,null,null,"Qhw","Qi,w,d ricircolo","Ql,w,er","Qi,w,d","Qi,w,s","TOTALE","da solare","da aria","da generatore","Ql, gn","Qsol,aux","h","kWh","Qpw","Qpw ren","Qpw nonren",null,"t.esterna","COPN (t.ext) x f x 0,95",null,null,null,"gen",{"$f":"+fc!W35/SUM(fc!$W$35:$W$46)","v":4.1145765100483261E-2},{"$f":"2000*AB18","v":82.29153020096652},{"$f":"+AC18*fc!E35","v":82.29153020096652},{"$f":"+IF(aquasys=TRUE,AD18*0.462,AD18)","v":38.018686952846537}]
[null,null,31,"gen",{"$f":"+Tabelle5!E44","v":956.72386574074062},{"$f":"+Tabelle5!H44","v":21.979000000000024},{"$f":"+E19*(1-$E$2)/$E$2","v":0},{"$f":"+(E19+G19)*$E$7","v":76.537909259259251},{"$f":"+bollitore!$J$58*24*C19*($T$9-tempcentr)/1000","v":54.163199999999996},{"$f":"+E19+F19+G19+H19+I19","v":1109.4039749999999},{"$f":"+fc!AD35","v":247.26443917049417},{"$f":"(J19-K19)*(1-1/W19)*$H$14","v":0},{"$f":"+J19-K19-L19","v":862.1395358295058},{"$f":"+M19*(1-$E$16)/$E$16*(1-$H$14)","v":95.793281758833956},{"$f":"+AE18*$AB$15/1000","v":3.4216818257561883},{"$f":"(E19+F19+G19+H19+I19+N19-fc!AD35)/potenza_gen_acs","v":106.43697973203774},{"$f":"+P19*$T$7","v":10.643697973203775},{"$f":"+(M19+N19)*$T$13+K19+L19+(Q19+O19)*$T$12","v":1287.1321167517342},{"$f":"+(M19+N19)*$V$13+(Q19+O19)*$V$12+K19+L19","v":253.87516767600536},{"$f":"+(M19+N19)*$U$13+(O19+Q19)*$U$12","v":1033.2569490757287},null,{"$f":"+'Dettaglio mesi'!E37","v":1.5},{"$f":"+VLOOKUP(V19,Tabelle6!$K$18:$M$73,3,TRUE)/100*0.919*0.95","v":0.64540049876378625},null,null,null,"feb",{"$f":"+fc!W36/SUM(fc!$W$35:$W$46)","v":5.6450504586486441E-2},{"$f":"2000*AB19","v":112.90100917297288},{"$f":"+AC19*fc!E36","v":112.90100917297288},52.160266237913469]
[null,null,28,"feb",{"$f":"+Tabelle5!E45","v":864.13768518518509},{"$f":"+Tabelle5!H45","v":19.852000000000022},{"$f":"+E20*(1-$E$2)/$E$2","v":0},{"$f":"+(E20+G20)*$E$7","v":69.131014814814804},{"$f":"+bollitore!$J$58*24*C20*($T$9-tempcentr)/1000","v":48.921599999999998},{"$f":"+E20+F20+G20+H20+I20","v":1002.0422999999998},{"$f":"+fc!AD36","v":366.03832491569671},{"$f":"(J20-K20)*(1-1/W20)*$H$14","v":0},636.00397508430319,{"$f":"+M20*(1-$E$16)/$E$16*(1-$H$14)","v":70.667108342700331},{"$f":"+AE19*$AB$15/1000","v":4.6944239614122125},{"$f":"(E20+F20+G20+H20+I20+N20-fc!AD36)/potenza_gen_acs","v":78.519009269667066},7.8519009269667066,{"$f":"+(M20+N20)*$T$13+K20+L20+(Q20+O20)*$T$12","v":1138.4050687439274},{"$f":"+(M20+N20)*$V$13+(Q20+O20)*$V$12+K20+L20","v":371.9350976132348},{"$f":"+(M20+N20)*$U$13+(O20+Q20)*$U$12","v":766.46997113069267},null,{"$f":"+'Dettaglio mesi'!F37","v":4.2},{"$f":"+VLOOKUP(V20,Tabelle6!$K$18:$M$73,3,TRUE)/100*0.919*0.95","v":0.7157375098658697},null,null,null,"mar",{"$f":"+fc!W37/SUM(fc!$W$35:$W$46)","v":8.6001973917728208E-2},172.00394783545642,{"$f":"+AC20*fc!E37","v":172.00394783545642},79.465823899980862]
[null,null,31,"mar",{"$f":"+Tabelle5!E46","v":956.72386574074062},{"$f":"+Tabelle5!H46","v":21.979000000000024},0,76.537909259259251,{"$f":"+bollitore!$J$58*24*C21*($T$9-tempcentr)/1000","v":54.163199999999996},{"$f":"+E21+F21+G21+H21+I21","v":1109.4039749999999},{"$f":"+fc!AD37","v":568.16688810748576},0,541.23708689251418,60.137454099168231,7.1519241509982772,{"$f":"(E21+F21+G21+H21+I21+N21-fc!AD37)/potenza_gen_acs","v":66.819393443520269},6.6819393443520276,1233.0881058075001,574.66880395030046,658.41930185719968,null,{"$f":"+'Dettaglio mesi'!G37","v":9.3000000000000007},{"$f":"+VLOOKUP(V21,Tabelle6!$K$18:$M$73,3,TRUE)/100*0.919*0.95","v":0.84861125560996997},null,null,null,"apr",{"$f":"+fc!W38/SUM(fc!$W$35:$W$46)","v":9.3067317157521173E-2},186.13463431504235,{"$f":"+AC21*fc!E38","v":186.13463431504235},85.994201053549574]
[null,null,30,"apr",{"$f":"+Tabelle5!E47","v":925.86180555555552},{"$f":"+Tabelle5!H47","v":21.270000000000024},0,74.06894444444444,{"$f":"+bollitore!$J$58*24*C22*($T$9-tempcentr)/1000","v":52.415999999999997},{"$f":"+E22+F22+G22+H22+I22","v":1073.6167499999999},{"$f":"+fc!AD38","v":616.99343167775748},0,456.62331832224243,50.735924258026927,7.7394780948194617,{"$f":"(E22+F22+G22+H22+I22+N22-fc!AD38)/potenza_gen_acs","v":56.373249175585478},5.6373249175585478,1182.092499676995,623.28052909357518,558.81197058341991,null,{"$f":"+'Dettaglio mesi'!H37","v":13.5},{"$f":"+VLOOKUP(V22,Tabelle6!$K$18:$M$73,3,TRUE)/100*0.919*0.95","v":0.99123602337579042},null,null,null,"mag",{"$f":"+fc!W39/SUM(fc!$W$35:$W$46)","v":0.11120388826850382},222.40777653700763,{"$f":"+AC22*fc!E39","v":222.40777653700763},102.75239276009754]
[null,null,31,"mag",{"$f":"+Tabelle5!E48","v":956.72386574074062},{"$f":"+Tabelle5!H48","v":21.979000000000024},0,76.537909259259251,{"$f":"+bollitore!$J$58*24*C23*($T$9-tempcentr)/1000","v":54.163199999999996},{"$f":"+E23+F23+G23+H23+I23","v":1109.4039749999999},{"$f":"+fc!AD39","v":731.87090654382484},0,377.5330684561751,41.948118717352777,9.2477153484087768,{"$f":"(E23+F23+G23+H23+I23+N23-fc!AD39)/potenza_gen_acs","v":46.609020797058662},4.660902079705866,1205.9850072520667,738.40795673503874,467.57705051702783,null,{"$f":"+'Dettaglio mesi'!I37","v":17.7},{"$f":"+VLOOKUP(V23,Tabelle6!$K$18:$M$73,3,TRUE)/100*0.919*0.95","v":1.1575222818021962},null,null,null,"giu",{"$f":"+fc!W40/SUM(fc!$W$35:$W$46)","v":0.11385463133778537},227.70926267557073,{"$f":"+AC23*fc!E40","v":227.70926267557073},105.20167935611369]
[null,null,30,"giu",{"$f":"+Tabelle5!E49","v":925.86180555555552},{"$f":"+Tabelle5!H49","v":21.270000000000024},0,74.06894444444444,{"$f":"+bollitore!$J$58*24*C24*($T$9-tempcentr)/1000","v":52.415999999999997},{"$f":"+E24+F24+G24+H24+I24","v":1073.6167499999999},{"$f":"+fc!AD40","v":749.98806461987715},0,323.62868538012276,35.958742820013633,9.4681511420502318,{"$f":"(E24+F24+G24+H24+I24+N24-fc!AD40)/potenza_gen_acs","v":39.954158688904045},3.9954158688904045,1160.1366963964967,756.3159411150192,403.82075528147743,null,{"$f":"+'Dettaglio mesi'!J37","v":22},{"$f":"+VLOOKUP(V24,Tabelle6!$K$18:$M$73,3,TRUE)/100*0.919*0.95","v":1.4013151791335863},null,null,null,"lug",{"$f":"+fc!W41/SUM(fc!$W$35:$W$46)","v":0.13011110342762633},260.22220685525264,{"$f":"+AC24*fc!E41","v":260.22220685525264},120.22265956712673]
[null,null,31,"lug",{"$f":"+Tabelle5!E50","v":956.72386574074062},{"$f":"+Tabelle5!H50","v":21.979000000000024},0,76.537909259259251,{"$f":"+bollitore!$J$58*24*C25*($T$9-tempcentr)/1000","v":54.163199999999996},1109.4039749999999,{"$f":"+fc!AD41","v":845.12493007697913},0,264.27904492302082,29.364338324780086,10.820039361041404,{"$f":"(E25+F25+G25+H25+I25+N25-fc!AD41)/potenza_gen_acs","v":32.627042583089001},3.2627042583089003,1187.5307220459979,851.74381957807373,335.78690246792405,null,{"$f":"+'Dettaglio mesi'!K37","v":24.4},{"$f":"+VLOOKUP(V25,Tabelle6!$K$18:$M$73,3,TRUE)/100*0.919*0.95","v":1.5109441688282843},null,null,null,"ago",{"$f":"+fc!W42/SUM(fc!$W$35:$W$46)","v":0.11704688173017906},234.09376346035813,{"$f":"+AC25*fc!E42","v":234.09376346035813},108.15131871868546]
[null,null,31,"ago",{"$f":"+Tabelle5!E51","v":956.72386574074062},{"$f":"+Tabelle5!H51","v":21.979000000000024},0,76.537909259259251,{"$f":"+bollitore!$J$58*24*C26*($T$9-tempcentr)/1000","v":54.163199999999996},1109.4039749999999,{"$f":"+fc!AD42","v":774.70294069886199},0,334.70103430113795,37.189003811237541,9.7336186846816908,{"$f":"(E26+F26+G26+H26+I26+N26-fc!AD42)/potenza_gen_acs","v":41.321115345819507},4.1321115345819512,1198.7425478474743,781.21983390191588,417.52271394555839,null,{"$f":"+'Dettaglio mesi'!L37","v":23.7},{"$f":"+VLOOKUP(V26,Tabelle6!$K$18:$M$73,3,TRUE)/100*0.919*0.95","v":1.4552206181391172},null,null,null,"set",{"$f":"+fc!W43/SUM(fc!$W$35:$W$46)","v":9.3793555065236553E-2},187.58711013047309,{"$f":"+AC26*fc!E43","v":187.58711013047309},86.665244880278578]
[null,null,30,"set",{"$f":"+Tabelle5!E52","v":925.86180555555552},{"$f":"+Tabelle5!H52","v":21.270000000000024},0,74.06894444444444,{"$f":"+bollitore!$J$58*24*C27*($T$9-tempcentr)/1000","v":52.415999999999997},1073.6167499999999,{"$f":"+fc!AD43","v":632.15317527927118},0,441.46357472072873,49.051508302303183,7.7998720392250727,{"$f":"(E27+F27+G27+H27+I27+N27-fc!AD43)/potenza_gen_acs","v":54.501675891447981},5.4501675891447983,1179.2591083541099,638.38069390460498,540.87841444950482,null,{"$f":"+'Dettaglio mesi'!M37","v":19.899999999999999},{"$f":"+VLOOKUP(V27,Tabelle6!$K$18:$M$73,3,TRUE)/100*0.919*0.95","v":1.250051424657594},null,null,null,"ott",{"$f":"+fc!W44/SUM(fc!$W$35:$W$46)","v":7.0546174353433841E-2},141.09234870686768,{"$f":"+AC27*fc!E44","v":141.09234870686768},65.184665102572879]
[null,null,31,"ott",{"$f":"+Tabelle5!E53","v":956.72386574074062},{"$f":"+Tabelle5!H53","v":21.979000000000024},0,76.537909259259251,{"$f":"+bollitore!$J$58*24*C28*($T$9-tempcentr)/1000","v":54.163199999999996},1109.4039749999999,{"$f":"+fc!AD44","v":476.66029261182268},0,632.74368238817726,70.30485359868635,5.8666198592315597,{"$f":"(E28+F28+G28+H28+I28+N28-fc!AD44)/potenza_gen_acs","v":78.116503998540395},7.8116503998540399,1247.9626694250167,483.08907963359292,764.87358979142368,null,{"$f":"+'Dettaglio mesi'!N37","v":14},{"$f":"+VLOOKUP(V28,Tabelle6!$K$18:$M$73,3,TRUE)/100*0.919*0.95","v":1.030531191285498},null,null,null,"nov",{"$f":"+fc!W45/SUM(fc!$W$35:$W$46)","v":4.4955782779163955E-2},89.911565558327908,{"$f":"+AC28*fc!E45","v":89.911565558327908},41.539143287947496]
[null,null,30,"nov",{"$f":"+Tabelle5!E54","v":925.86180555555552},{"$f":"+Tabelle5!H54","v":21.270000000000024},0,74.06894444444444,{"$f":"+bollitore!$J$58*24*C29*($T$9-tempcentr)/1000","v":52.415999999999997},1073.6167499999999,{"$f":"+fc!AD45","v":287.83762386414384},0,785.77912613585613,87.308791792872881,3.7385228959152745,{"$f":"(E29+F29+G29+H29+I29+N29-fc!AD45)/potenza_gen_acs","v":97.00976865874766},9.7009768658747664,1237.1035271128412,294.15418875218518,942.94933836065616,null,{"$f":"+'Dettaglio mesi'!O37","v":7.8},{"$f":"+VLOOKUP(V29,Tabelle6!$K$18:$M$73,3,TRUE)/100*0.919*0.95","v":0.78574500000000003},null,null,null,"dic",{"$f":"+fc!W46/SUM(fc!$W$35:$W$46)","v":4.1822422275851971E-2},83.64484455170394,{"$f":"+AC29*fc!E46","v":83.64484455170394},38.643918182887219]
[null,null,31,"dic",{"$f":"+Tabelle5!E55","v":956.72386574074062},{"$f":"+Tabelle5!H55","v":21.979000000000024},0,76.537909259259251,{"$f":"+bollitore!$J$58*24*C30*($T$9-tempcentr)/1000","v":54.163199999999996},1109.4039749999999,{"$f":"+fc!AD46","v":255.74868213978442},0,853.65529286021547,94.850588095579468,3.4779526364598494,{"$f":"(E30+F30+G30+H30+I30+N30-fc!AD46)/potenza_gen_acs","v":105.38954232842167},10.538954232842167,1285.60077176708,262.33662836835634,1023.2641433987236,null,{"$f":"+'Dettaglio mesi'!P37","v":3.5},{"$f":"+VLOOKUP(V30,Tabelle6!$K$18:$M$73,3,TRUE)/100*0.919*0.95","v":0.69232874732536342}]
[null,null,null,null,{"$f":"SUM(E19:E30)","v":11264.651967592592},258.78500000000025,0,901.17215740740721,637.72800000000007,13062.337124999996,6552.549699706,0,6509.7874252940001,723.30971392155539,83.160000000000011,null,{"$f":"SUM(Q19:Q30)","v":80.367745991283954},{"$f":"SUM(R19:R30)","v":14543.038841181238},{"$f":"SUM(S19:S30)","v":6629.4077403219026},{"$f":"SUM(T19:T30)","v":7913.6311008593366},{"$f":"+S31/R31","v":0.45584748914714707},null,null,null,null,null,null,{"$f":"SUM(AB18:AB30)","v":0.99999999999999989},1999.9999999999998,{"$f":"SUM(AD18:AD29)","v":1999.9999999999998},{"$f":"SUM(AE18:AE29)","v":924.00000000000011},{"$f":"+AE31*AB15","v":83160.000000000015},{"$f":"+AF31/1000","v":83.160000000000011}]
[null,null,null,null,null,{"$f":"+F31/E31","v":2.2973190893469397E-2},{"$f":"+G31/E31","v":0},{"$f":"+H31/E31","v":7.9999999999999988E-2},{"$f":"+I31/E31","v":5.6613200464132152E-2},null,null,null,null,null,null,null,null,null,null,null,null,null,null,null,null,null,null,null,null,null,null,"Wh","kWh"]
[]
["rendimento globale ACS",null,null,null,"?"]
[]
[null,null,null,"ADOTTA IL CALCOLO CTI","?"]
[null,null,null,"COPERTURA SOLARE EN.PRIM.ACS","?"]
[]
[]
[]
["Rendimenti per riscaldamento:"]
[]
["emissione",null,null,"descrizione","eta"]
[null,null,1,"Ad aria (termoconv., venticonv.)",0.98]
[null,null,2,"Radiatori",0.96]
[null,null,3,"Pannelli radianti",0.96]
[null,null,4,"--- non presente riscaldamento ---",1]
[null,null,4,{"$f":"+VLOOKUP(C48,C44:E47,2)","v":"--- non presente riscaldamento ---"},{"$f":"+VLOOKUP(C48,C44:E47,3)","v":1}]
[]
[]
["regolazione",null,null,null,98,null,"%"]
[null,null,null,null,{"$f":"+regolaz_risc/100","v":0.98}]
[]
["distribuzione",null,null,null,92,null,"%"]
[null,null,null,null,{"$f":"+distrib_risc/100","v":0.92}]
[]
["combustione","eta, c",null,"dal foglio TABELLE6",{"$f":"+Tabelle6!C11/100","v":0.91}]
[]
[]
["rendimento globale RISC",null,null,null,{"$f":"+E48*E52*E55*E57","v":0.82045600000000007}]

{"sheet":"fc","index":17,"n_rows":55,"n_cols":34,"rows_kept":55,"cut":false,"hidden":true,"merged":[]}
[]
[]
[null,"Fabbisogno applicato all'impianto solare per acqua calda sanitaria",null,null,null,null,null,null,"QW,gn,out",{"$f":"+S47","v":13062.337124999996},"kWh/anno",null,null,null,null,null,null,null,null,null,"XH","XW","YH","YW"]
[null,"Fabbisogno applicato all'impianto solare per riscaldamento",null,null,null,null,null,null,"QH,gn,out",{"$f":"+R47","v":0},"kWh/anno"]
[null,null,null,null,null,null,null,null,null,null,null,null,null,null,null,null,null,null,null,null,{"$f":"+$F35*$D$20*$D$22*Q35*$J35*M35/(R35*1000)","v":{"$error":"#DIV/0!"}},{"$f":"+$G35*$D$20*$D$22*P35*$K35*M35/(S35*1000)","v":1.2417750170321622},{"$f":"+$F35*$J$10*$J$7*$D$22*W35/(R35*1000)","v":{"$error":"#DIV/0!"}},{"$f":"+$G35*$J$10*$J$7*$D$22*W35/(S35*1000)","v":0.3153670103539381}]
[null,"Superficie di apertura collettore solare",null,null,null,null,null,null,"A",{"$f":"+superficie","v":8},"m2",null,null,null,null,null,null,null,null,null,{"$error":"#DIV/0!"},{"$f":"+$G36*$D$20*$D$22*P36*$K36*M36/(S36*1000)","v":1.173072679046917},{"$error":"#DIV/0!"},{"$f":"+$G36*$J$10*$J$7*$D$22*W36/(S36*1000)","v":0.4790298861420671}]
[null,"Coefficienti collettore solare",null,null,null,null,null,null,"h0",{"$f":"+eta0","v":0.68700000000000006},null,null,null,null,null,null,null,null,null,null,{"$error":"#DIV/0!"},1.0433015961858982,{"$error":"#DIV/0!"},0.659173193954115]
[null,null,null,null,null,null,null,null,"a1",{"$f":"+kappa1","v":0.61299999999999999},null,null,null,null,null,null,null,null,null,null,{"$error":"#DIV/0!"},0.9364312926532945,{"$error":"#DIV/0!"},0.73710397377106129]
[null,null,null,null,null,null,null,null,"a2",{"$f":"+kappa2","v":3.0000000000000001E-3},null,null,null,null,null,null,null,null,null,null,{"$error":"#DIV/0!"},0.82956098912069065,{"$error":"#DIV/0!"},0.8523365089293119]
[null,null,null,null,null,null,null,null,"IAM",{"$f":"+IAM","v":1},null,null,null,null,null,null,null,null,null,null,{"$error":"#DIV/0!"},0.72014615455159625,{"$error":"#DIV/0!"},0.90174191923118774]
[null,"Coerrifiente di scambio termico dello scambiatore di calore",null,null,null,null,null,null,"(Ust)hx",2300,"W/K",null,null,null,null,null,null,null,null,null,{"$error":"#DIV/0!"},0.65907740967582296,{"$error":"#DIV/0!"},0.99725329208523117]
[null,"Volume serbatoio riscaldato dal solare",null,null,null,null,null,null,"Vnom",{"$f":"+bollitore!C58","v":500},"litri",null,null,null,null,null,null,null,null,null,{"$error":"#DIV/0!"},0.67688912693125702,{"$error":"#DIV/0!"},0.89712088406551493]
[null,null,null,null,null,null,null,null,null,null,null,null,null,null,null,null,null,null,null,null,{"$error":"#DIV/0!"},0.77358130631789834,{"$error":"#DIV/0!"},0.74285586244723467]
[null,null,null,null,null,null,null,null,null,null,null,null,null,null,null,null,null,null,null,null,{"$error":"#DIV/0!"},0.92370863747084164,{"$error":"#DIV/0!"},0.54071022967777538]
[null,null,null,null,null,null,null,null,null,null,null,null,null,null,null,null,null,null,null,null,{"$error":"#DIV/0!"},1.0814695617332566,{"$error":"#DIV/0!"},0.35605502707705855]
[null,null,null,null,null,null,null,null,null,null,null,null,null,null,null,null,null,null,null,null,{"$error":"#DIV/0!"},1.1908843963023508,{"$error":"#DIV/0!"},0.32055333633206573]
[null,"Rapporto","PW","??"]
[null,null,"PH","??"]
[]
[null,null,"Uloop",{"$f":"+J8+40*J9+(5+0.5*J6)/IF(J6=0,0.0000000000000000001,J6)","v":1.8580000000000001},"W/m2 K",null,null,null,null,null,null,"Temperatura di riferimento, imp.acs","vedi calcolo mensile"]
[null,null,"Dh",{"$f":"+J7*J6*J8/J11","v":1.4648034782608697E-3},null,null,null,null,null,null,null,"Temperatura di riferimento, imp.risc",100,"°C"]
[null,null,"hloop",{"$f":"+IF(aquasys=TRUE,1,0.8)","v":1},{"$f":"1-D21","v":0.99853519652173917}]
[]
[null,null,null,null,null,null,null,null,null,null,null,null,null,null,null,"Vsol"]
[null,null,null,null,null,null,null,null,null,null,null,"Vsol",{"$f":"+VLOOKUP(N25,O25:P28,2,FALSE)","v":409.4},{"$f":"+IF(preriscaldo=TRUE,1,2)","v":2},1,{"$f":"+J12","v":500},"1 = preriscaldo"]
[null,null,null,null,null,null,null,null,null,null,null,null,null,null,2,{"$f":"+J12*(1-R27)","v":409.4},"2 = bollitore con solare tradiz. (solare sotto, caldaia sopra)"]
[null,null,null,null,null,null,null,null,null,null,null,null,null,null,null,null,"f aux =",{"$f":"+bollitore!D59*U27","v":0.1812},null,"x =",{"$f":"+IF(aquasys=TRUE,0.3,1)","v":0.3}]
[]
[]
[null,null,null,null,null,null,null,null,null,null,null,null,null,null,null,null,null,"PDC?"]
[null,null,null,null,null,null,null,null,null,null,null,null,null,null,null,null,null,{"$f":"+Tabelle6!P10","v":false}]
[]
[null,null,null,"pH","pW","A*pH","A*pW","Vol_H","Vol_W","fst_H","fst_W",null,"tm","Te,avg","Tref, acs","DTW","DTH","QH,gn,out","QW,gn,out","Qgn,out","XH","XW","Im",null,"YH","YW","Qsol,out H","Qsol,out W","Qsol,out H","Qsol,out W","Qsol,out","f","fH","fW"]
[null,null,null,null,null,null,null,null,null,null,null,null,"ore","°C","°C","K",null,"[kWh]","[kWh]","[kWh]",null,null,"Wh/m2","kWh/m2",null,null,"kWh","kWh","kWh","kWh","kWh"]
[null,null,"gen",{"$f":"+R35/(R35+S35)","v":0},{"$f":"+S35/(R35+S35)","v":1},{"$f":"+$J$6*D35","v":0},{"$f":"+$J$6*E35","v":8},{"$f":"+$M$25*D35","v":0},{"$f":"+$M$25*E35","v":409.4},{"$f":"+(F35*75/H35)^0.25","v":{"$error":"#DIV/0!"}},{"$f":"+(G35*75/I35)^0.25","v":1.1002740063835843},null,{"$f":"31*24","v":744},{"$f":"+'Dettaglio mesi'!E37","v":1.5},{"$f":"11.6+1.18*40+3.86*15-1.32*N35","v":114.71999999999998},{"$f":"+O35-N35","v":113.21999999999998},{"$f":"+$M$21-N35","v":98.5},{"$f":"IF(INTEGRAZ=TRUE,fabb_risc!D11,0)*IF($R$31=TRUE,1,(Tabelle6!$C$11/100))","v":0},{"$f":"IF(ACS=TRUE,cti!E19+cti!F19+cti!G19+cti!H19+cti!I19,0)","v":1109.4039749999999},{"$f":"+S35+R35","v":1109.4039749999999},{"$f":"+IF(U5<0,0,IF(U5>18,18,U5))","v":{"$error":"#DIV/0!"}},{"$f":"+IF(V5<0,0,IF(V5>18,18,V5))","v":1.2417750170321622},{"$f":"1000*X35","v":63658.918280663216},{"$f":"+'UNI8477'!E18","v":63.658918280663215},{"$f":"+IF(W5<0,0,IF(W5>3,3,W5))","v":{"$error":"#DIV/0!"}},{"$f":"+IF(X5<0,0,IF(X5>3,3,X5))","v":0.3153670103539381},{"$f":"+($E$50*Y35+$E$51*U35+$E$52*Y35^2+$E$53*U35^2+$E$54*Y35^3+$E$55*U35^3)*R35","v":{"$error":"#DIV/0!"}},{"$f":"+($E$50*Z35+$E$51*V35+$E$52*Z35^2+$E$53*V35^2+$E$54*Z35^3+$E$55*V35^3)*S35","v":247.26443917049417},{"$f":"+IF(R35=0,0,IF(AA35<0,0,IF(AA35>R35,R35,AA35)))","v":0},{"$f":"+IF(S35=0,0,IF(AB35<0,0,IF(AB35>S35,S35,AB35)))","v":247.26443917049417},{"$f":"+AD35+AC35","v":247.26443917049417},{"$f":"+AE35/T35","v":0.22288043376669367},{"$f":"+($E$50*Y35+$E$51*U35+$E$52*Y35^2+$E$53*U35^2+$E$54*Y35^3+$E$55*U35^3)","v":{"$error":"#DIV/0!"}},{"$f":"+($E$50*Z35+$E$51*V35+$E$52*Z35^2+$E$53*V35^2+$E$54*Z35^3+$E$55*V35^3)","v":0.22288043376669367}]
[null,null,"feb",0,1,0,8,{"$f":"+$M$25*D36","v":0},409.4,{"$error":"#DIV/0!"},1.1002740063835843,null,{"$f":"28*24","v":672},{"$f":"+'Dettaglio mesi'!F37","v":4.2},111.15599999999999,106.95599999999999,95.8,{"$f":"IF(INTEGRAZ=TRUE,fabb_risc!E11,0)*IF($R$31=TRUE,1,(Tabelle6!$C$11/100))","v":0},{"$f":"IF(ACS=TRUE,cti!E20+cti!F20+cti!G20+cti!H20+cti!I20,0)","v":1002.0422999999998},1002.0422999999998,{"$f":"+IF(U6<0,0,IF(U6>18,18,U6))","v":{"$error":"#DIV/0!"}},1.173072679046917,87337.738151116253,{"$f":"+'UNI8477'!F18","v":87.337738151116255},{"$f":"+IF(W6<0,0,IF(W6>3,3,W6))","v":{"$error":"#DIV/0!"}},{"$f":"+IF(X6<0,0,IF(X6>3,3,X6))","v":0.4790298861420671},{"$error":"#DIV/0!"},366.03832491569671,0,366.03832491569671,366.03832491569671,0.36529228847494438,{"$error":"#DIV/0!"},0.36529228847494438]
[null,null,"mar",0,1,0,8,{"$f":"+$M$25*D37","v":0},409.4,{"$error":"#DIV/0!"},1.1002740063835843,null,{"$f":"31*24","v":744},{"$f":"+'Dettaglio mesi'!G37","v":9.3000000000000007},104.42399999999999,95.123999999999995,90.7,{"$f":"IF(INTEGRAZ=TRUE,fabb_risc!F11,0)*IF($R$31=TRUE,1,(Tabelle6!$C$11/100))","v":0},{"$f":"IF(ACS=TRUE,cti!E21+cti!F21+cti!G21+cti!H21+cti!I21,0)","v":1109.4039749999999},1109.4039749999999,{"$error":"#DIV/0!"},1.0433015961858982,133058.47190431968,{"$f":"+'UNI8477'!G18","v":133.05847190431967},{"$error":"#DIV/0!"},0.659173193954115,{"$error":"#DIV/0!"},568.16688810748576,0,568.16688810748576,568.16688810748576,0.51213705819603339,{"$error":"#DIV/0!"},0.51213705819603339]
[null,null,"apr",0,1,0,8,{"$f":"+$M$25*D38","v":0},409.4,{"$error":"#DIV/0!"},1.1002740063835843,null,{"$f":"30*24","v":720},{"$f":"+'Dettaglio mesi'!H37","v":13.5},98.88,85.38,86.5,{"$f":"IF(INTEGRAZ=TRUE,fabb_risc!G11,0)*IF($R$31=TRUE,1,(Tabelle6!$C$11/100))","v":0},{"$f":"IF(ACS=TRUE,cti!E22+cti!F22+cti!G22+cti!H22+cti!I22,0)","v":1073.6167499999999},1073.6167499999999,{"$error":"#DIV/0!"},0.9364312926532945,143989.66024966739,{"$f":"+'UNI8477'!H18","v":143.98966024966739},{"$error":"#DIV/0!"},0.73710397377106129,{"$error":"#DIV/0!"},616.99343167775748,0,616.99343167775748,616.99343167775748,0.57468685327213598,{"$error":"#DIV/0!"},0.57468685327213598]
[null,null,"mag",0,1,0,8,{"$f":"+$M$25*D39","v":0},409.4,{"$error":"#DIV/0!"},1.1002740063835843,null,{"$f":"31*24","v":744},{"$f":"+'Dettaglio mesi'!I37","v":17.7},93.335999999999984,75.635999999999981,82.3,{"$f":"IF(INTEGRAZ=TRUE,fabb_risc!H11,0)*IF($R$31=TRUE,1,(Tabelle6!$C$11/100))","v":0},{"$f":"IF(ACS=TRUE,cti!E23+cti!F23+cti!G23+cti!H23+cti!I23,0)","v":1109.4039749999999},1109.4039749999999,{"$error":"#DIV/0!"},{"$f":"+IF(V9<0,0,IF(V9>18,18,V9))","v":0.82956098912069065},172049.76547376299,{"$f":"+'UNI8477'!I18","v":172.04976547376299},{"$error":"#DIV/0!"},0.8523365089293119,{"$error":"#DIV/0!"},731.87090654382484,0,731.87090654382484,731.87090654382484,0.65969738980232595,{"$error":"#DIV/0!"},0.65969738980232595]
[null,null,"giu",0,1,0,8,0,409.4,{"$error":"#DIV/0!"},1.1002740063835843,null,{"$f":"30*24","v":720},{"$f":"+'Dettaglio mesi'!J37","v":22},87.659999999999982,65.659999999999982,78,{"$f":"IF(INTEGRAZ=TRUE,fabb_risc!I11,0)*IF($R$31=TRUE,1,(Tabelle6!$C$11/100))","v":0},{"$f":"IF(ACS=TRUE,cti!E24+cti!F24+cti!G24+cti!H24+cti!I24,0)","v":1073.6167499999999},1073.6167499999999,{"$error":"#DIV/0!"},0.72014615455159625,176150.87857782937,{"$f":"+'UNI8477'!J18","v":176.15087857782936},{"$error":"#DIV/0!"},0.90174191923118774,{"$error":"#DIV/0!"},749.98806461987715,0,749.98806461987715,749.98806461987715,0.69856218675786985,{"$error":"#DIV/0!"},0.69856218675786985]
[null,null,"lug",0,1,0,8,0,409.4,{"$error":"#DIV/0!"},1.1002740063835843,null,{"$f":"31*24","v":744},{"$f":"+'Dettaglio mesi'!K37","v":24.4},84.49199999999999,60.091999999999992,75.599999999999994,{"$f":"IF(INTEGRAZ=TRUE,fabb_risc!J11,0)*IF($R$31=TRUE,1,(Tabelle6!$C$11/100))","v":0},{"$f":"IF(ACS=TRUE,cti!E25+cti!F25+cti!G25+cti!H25+cti!I25,0)","v":1109.4039749999999},1109.4039749999999,{"$error":"#DIV/0!"},0.65907740967582296,201302.17727823713,{"$f":"+'UNI8477'!K18","v":201.30217727823714},{"$error":"#DIV/0!"},0.99725329208523117,{"$error":"#DIV/0!"},845.12493007697913,0,845.12493007697913,845.12493007697913,0.76178285739149187,{"$error":"#DIV/0!"},0.76178285739149187]
[null,null,"ago",0,1,0,8,0,409.4,{"$error":"#DIV/0!"},1.1002740063835843,null,{"$f":"31*24","v":744},{"$f":"+'Dettaglio mesi'!L37","v":23.7},85.415999999999997,61.715999999999994,76.3,{"$f":"IF(INTEGRAZ=TRUE,fabb_risc!K11,0)*IF($R$31=TRUE,1,(Tabelle6!$C$11/100))","v":0},{"$f":"IF(ACS=TRUE,cti!E26+cti!F26+cti!G26+cti!H26+cti!I26,0)","v":1109.4039749999999},1109.4039749999999,{"$error":"#DIV/0!"},0.67688912693125702,181089.78799814341,{"$f":"+'UNI8477'!L18","v":181.08978799814341},{"$error":"#DIV/0!"},0.89712088406551493,{"$error":"#DIV/0!"},774.70294069886199,0,774.70294069886199,774.70294069886199,0.6983055389709254,{"$error":"#DIV/0!"},0.6983055389709254]
[null,null,"set",0,1,0,8,0,409.4,{"$error":"#DIV/0!"},1.1002740063835843,null,{"$f":"30*24","v":720},{"$f":"+'Dettaglio mesi'!M37","v":19.899999999999999},90.431999999999988,70.531999999999982,80.099999999999994,{"$f":"IF(INTEGRAZ=TRUE,fabb_risc!L11,0)*IF($R$31=TRUE,1,(Tabelle6!$C$11/100))","v":0},{"$f":"IF(ACS=TRUE,cti!E27+cti!F27+cti!G27+cti!H27+cti!I27,0)","v":1073.6167499999999},1073.6167499999999,{"$error":"#DIV/0!"},0.77358130631789834,145113.26360244671,{"$f":"+'UNI8477'!M18","v":145.11326360244669},{"$error":"#DIV/0!"},0.74285586244723467,{"$error":"#DIV/0!"},632.15317527927118,0,632.15317527927118,632.15317527927118,0.58880710950091941,{"$error":"#DIV/0!"},0.58880710950091941]
[null,null,"ott",0,1,0,8,0,409.4,{"$error":"#DIV/0!"},1.1002740063835843,null,{"$f":"31*24","v":744},{"$f":"+'Dettaglio mesi'!N37","v":14},98.219999999999985,84.219999999999985,86,{"$f":"IF(INTEGRAZ=TRUE,fabb_risc!M11,0)*IF($R$31=TRUE,1,(Tabelle6!$C$11/100))","v":0},{"$f":"IF(ACS=TRUE,cti!E28+cti!F28+cti!G28+cti!H28+cti!I28,0)","v":1109.4039749999999},1109.4039749999999,{"$f":"+IF(U14<0,0,IF(U14>18,18,U14))","v":{"$error":"#DIV/0!"}},0.92370863747084164,109145.93852396047,{"$f":"+'UNI8477'!N18","v":109.14593852396047},{"$error":"#DIV/0!"},0.54071022967777538,{"$error":"#DIV/0!"},476.66029261182268,0,476.66029261182268,476.66029261182268,0.42965439402885025,{"$error":"#DIV/0!"},0.42965439402885025]
[null,null,"nov",0,1,0,8,0,409.4,{"$error":"#DIV/0!"},1.1002740063835843,null,{"$f":"30*24","v":720},{"$f":"+'Dettaglio mesi'!O37","v":7.8},106.404,98.603999999999999,92.2,{"$f":"IF(INTEGRAZ=TRUE,fabb_risc!N11,0)*IF($R$31=TRUE,1,(Tabelle6!$C$11/100))","v":0},{"$f":"IF(ACS=TRUE,cti!E29+cti!F29+cti!G29+cti!H29+cti!I29,0)","v":1073.6167499999999},1073.6167499999999,{"$error":"#DIV/0!"},1.0814695617332566,69553.610078535945,{"$f":"+'UNI8477'!O18","v":69.553610078535939},{"$error":"#DIV/0!"},0.35605502707705855,{"$error":"#DIV/0!"},287.83762386414384,0,287.83762386414384,287.83762386414384,0.26810090645860718,{"$error":"#DIV/0!"},0.26810090645860718]
[null,null,"dic",0,1,0,8,0,409.4,{"$error":"#DIV/0!"},1.1002740063835843,null,{"$f":"31*24","v":744},{"$f":"+'Dettaglio mesi'!P37","v":3.5},112.07999999999998,108.57999999999998,96.5,{"$f":"IF(INTEGRAZ=TRUE,fabb_risc!O11,0)*IF($R$31=TRUE,1,(Tabelle6!$C$11/100))","v":0},{"$f":"IF(ACS=TRUE,cti!E30+cti!F30+cti!G30+cti!H30+cti!I30,0)","v":1109.4039749999999},1109.4039749999999,{"$error":"#DIV/0!"},1.1908843963023508,64705.812504786307,{"$f":"+'UNI8477'!P18","v":64.705812504786309},{"$error":"#DIV/0!"},0.32055333633206573,{"$error":"#DIV/0!"},255.74868213978442,0,255.74868213978442,255.74868213978442,0.23052800233547427,{"$error":"#DIV/0!"},0.23052800233547427]
[null,null,null,null,null,null,null,null,null,null,null,null,null,null,null,null,null,{"$f":"SUM(R35:R46)","v":0},{"$f":"SUM(S35:S46)","v":13062.337124999996},{"$f":"SUM(T35:T46)","v":13062.337124999996},null,null,null,null,null,null,null,null,{"$f":"SUM(AC35:AC46)","v":0},{"$f":"SUM(AD35:AD46)","v":6552.549699706},6552.549699706,{"$f":"+SUM(AE35:AE46)/T47","v":0.5016368538800825},{"$f":"+AC47/R47","v":{"$error":"#DIV/0!"}},{"$f":"+AD47/S47","v":0.5016368538800825}]
[null,null,null,null,null,null,null,null,null,null,null,null,null,null,null,null,null,null,null,null,"X limitate a 18",null,null,null,"Y limitate a 3"]
[]
[null,null,null,"a",1.0289999999999999]
[null,null,null,"b",-6.5000000000000002E-2]
[null,null,null,"c",-0.245]
[null,null,null,"d",1.8E-3]
[null,null,null,"e",2.1499999999999998E-2]
[null,null,null,"f",0]

{"sheet":"Tabelle","index":18,"n_rows":43,"n_cols":10,"rows_kept":43,"cut":false,"hidden":true,"merged":[]}
[null,null,null,null,null,null,null,null,"**","**"]
["Rendimento pannellli",null,"eta0","a1","a2","RADdiff","IAM (50)","TIPO","R.app.inv.","R.app.est"]
[1,"Star",0.64400000000000002,0.749,5.0000000000000001E-3,1,1,"CPC",0.5,0.61]
[2,"CSO 21",0.745,2.0070000000000001,5.0000000000000001E-3,0.9,1,"CSO",0.5,0.61]
[3,"AQUA PLASMA",0.68700000000000006,0.61299999999999999,3.0000000000000001E-3,1,1,"CPC",0.5,0.61]
[4,"EasySun II",0.80100000000000005,3.65,1.6899999999999998E-2,0.85,0.94,"PIANO",0.4,0.6]
[5]
[6]
[7]
[8]
[9]
[10]
["Scelto",3]
[null,{"$f":"VLOOKUP(B13,A3:E12,2,FALSE)","v":"AQUA PLASMA"},{"$f":"VLOOKUP(B13,A3:E12,3,FALSE)","v":0.68700000000000006},{"$f":"VLOOKUP(B13,A3:E12,4,FALSE)","v":0.61299999999999999},{"$f":"VLOOKUP(B13,A3:E12,5,FALSE)","v":3.0000000000000001E-3},{"$f":"VLOOKUP(B13,A3:F12,6,FALSE)","v":1},{"$f":"VLOOKUP(B13,A3:G12,7,FALSE)","v":1},{"$f":"VLOOKUP(B13,A3:H12,8,FALSE)","v":"CPC"},{"$f":"VLOOKUP(B13,A3:J12,9,FALSE)","v":0.5},{"$f":"VLOOKUP(B13,A3:J12,10,FALSE)","v":0.61}]
["Non modificare la posizione pannelli, vedi fogli \"Dettaglio Solar o CPC\", prime celle con rendimenti"]
["usato nel folgio DETTAGLIO, riga 213"]
[]
[]
[]
[]
[]
[]
[]
[]
["COOLING",false,null,{"$f":"1*cooling","v":0}]
[]
["Fabbisogni scelti",null,null,null,null,"calcolo",null,"ordine"]
["ACS",true,{"$f":"IF(ACS=FALSE,\"NO\",\"SI\")","v":"SI"},{"$f":"1*ACS","v":1},null,{"$f":"+IF(AND(D29=0,D30=0,D28=1),1,0)","v":1},"solo acs bollitore solare",1]
["INTEGRAZ",false,{"$f":"IF(INTEGRAZ=FALSE,\"NO\",\"SI\")","v":"NO"},{"$f":"1*INTEGRAZ","v":0},null,{"$f":"+IF(AND(D29=0,D28=0,D30=1),1,0)","v":0},"solo piscina (solare)",2]
["PISCINA",false,{"$f":"IF(PISCINA=FALSE,\"NO\",\"SI\")","v":"NO"},{"$f":"1*PISCINA","v":0},null,{"$f":"+IF(AND(D30=0,D28=0,D29=1),1,0)","v":0},"solo integrazione",3,"*"]
["HOTEL",false,{"$f":"IF(HOTEL=FALSE,\"NO\",\"SI\")","v":"NO"},null,null,{"$f":"+IF(AND(D28=1,D29=1,D30=0),1,0)","v":0},"acs e integrazione riscaldamento",4,"*"]
[null,true,null,null,null,{"$f":"+IF(AND(D28=1,D30=1,D34=0,D29=0),1,0)","v":0},"acs e piscina solare",5]
["Piscina eserna",false,null,null,null,{"$f":"+IF(AND(D28=1,D30=1,D34=1,D29=0),1,0)","v":0},"acs e piscina circuito",6]
["Caldaia piscina",true,{"$f":"IF(caldaia_piscina=FALSE,\"NO\",\"SI\")","v":"SI"},{"$f":"1*caldaia_piscina","v":1},null,{"$f":"+IF(AND(D28=1,D29=1,D30=1,D34=0),1,0)","v":0},"acs, riscaldamento e piscina solare",7,"*"]
["Telo copertura",true,null,null,null,{"$f":"+IF(AND(D28=1,D29=1,D30=1,D34=1),1,0)","v":0},"acs, riscaldamento e piscina circuito",8,"*"]
[null,null,null,null,null,{"$f":"+IF(AND(D28=0,D29=1,D30=1),1,0)","v":0},"piscina e integrazione",9,"*","* con possibilità di raffrescamento COOLING"]
[null,null,null,null,null,null,null,{"$f":"IF(+ISERROR(+VLOOKUP(1,F28:H36,3,FALSE))=TRUE,0,+VLOOKUP(1,F28:H36,3,FALSE))","v":1}]
[]
[]
[]
["AQUAsys",true]
[]
["Preriscaldo",false]

{"sheet":"TabellaCD","index":19,"n_rows":19,"n_cols":10,"rows_kept":19,"cut":false,"hidden":true,"merged":[]}
[]
[null,null,"Temperatura circuito riscaldamento",null,null,null,null,"Temperatura circuito raffrescamento"]
[null,null,"R","M","piede",null,null,"R","M","media"]
[null,1,30,40,20,null,1,70,80,{"$f":"+AVERAGE(H4:I4)","v":75}]
[null,2,35,50,20,null,2,80,90,{"$f":"+AVERAGE(H5:I5)","v":85}]
[null,3,50,70,30,null,3]
[null,4,70,90,30,null,4]
[null,2,{"$f":"VLOOKUP(B8,B4:E7,2,FALSE)","v":35},{"$f":"VLOOKUP(B8,B4:E7,3,FALSE)","v":50},{"$f":"VLOOKUP(B8,B4:E7,4,FALSE)","v":20},null,1,{"$f":"VLOOKUP(G8,G4:I7,2,FALSE)","v":70},{"$f":"VLOOKUP(G8,G4:I7,3,FALSE)","v":80},{"$f":"VLOOKUP(G8,G4:J7,4,FALSE)","v":75}]
[]
[]
[]
[]
[null,null,null,null,null,null,null,"Temperatura circuito piscina"]
[null,null,null,null,null,null,null,"R","M","media"]
[null,null,null,null,null,null,1,35,50,{"$f":"+AVERAGE(H15:I15)","v":42.5}]
[null,null,null,null,null,null,2,40,55,{"$f":"+AVERAGE(H16:I16)","v":47.5}]
[null,null,null,null,null,null,3,45,60,{"$f":"+AVERAGE(H17:I17)","v":52.5}]
[null,null,null,null,null,null,4,50,65,{"$f":"+AVERAGE(H18:I18)","v":57.5}]
[null,null,null,null,null,null,1,{"$f":"VLOOKUP(G19,G15:J18,2,FALSE)","v":35},{"$f":"VLOOKUP(G19,G15:J18,3,FALSE)","v":50},{"$f":"VLOOKUP(G19,G15:J18,4,FALSE)","v":42.5}]

{"sheet":"Tabelle2","index":20,"n_rows":12,"n_cols":11,"rows_kept":12,"cut":false,"hidden":true,"merged":[]}
[]
["Località scelta",null,15,{"$f":"VLOOKUP(C2,'Tabelle UNI'!AJ5:AL105,3,FALSE)","v":"Brescia"}]
[]
[]
["Latitudine",null,null,"L","gradi °",{"$f":"VLOOKUP(localitàscelta,'Tabelle UNI'!Z5:AG105,5,FALSE)","v":"45"},null,null,null,85,"controllo per l'azimut sul foglio dati"]
[null,null,null,null,"rad",{"$f":"F5/180*PI()","v":0.78539816339744828},null,null,null,30,"controllo per inclinazione sul foglio dati"]
["Costante solare",null,null,"Ics","W/m2",1353,null,null,null,80,"controllo per la superficie del foglio dati"]
["Inclinazione del collettore b",null,null,null,"rad",{"$f":"F9/180*PI()","v":0.52359877559829882}]
[null,null,null,null,"°",{"$f":"Dati!E13","v":30},null,{"$f":"+ABS(F9)+ABS(F11)","v":35}]
["Azimut del collettore",null,null,null,"rad",{"$f":"F11/180*PI()","v":-8.7266462599716474E-2},null,{"$f":"+IF(H9>130,H11,\"\")","v":""}]
[null,null,null,null,"°",{"$f":"Dati!N13","v":-5},null,"Attenzione: dati di input non adatti per la simulazione. Diminuire l'inclinazione del pannello oppure l'esposizione."]
["Altitudine località",null,null,null,"m",{"$f":"VLOOKUP(localitàscelta,'Tabelle UNI'!Z5:AG105,4,FALSE)","v":149}]

{"sheet":"Tabelle3","index":21,"n_rows":18,"n_cols":10,"rows_kept":18,"cut":false,"hidden":true,"merged":[]}
[]
["Coefficiente riflessione del terreno  UNI 8477 P 1a 1983",null,null,null,null,null,null,"Scelto"]
[1,"Neve",null,null,0.75,null,null,"Gen",{"$f":"J18","v":0.22}]
[2,"Superfici acquose",null,null,7.0000000000000007E-2,null,null,"Feb",{"$f":"J18","v":0.22}]
[3,"Suolo",null,null,0.14000000000000001,null,null,"Mar",{"$f":"J18","v":0.22}]
[4,"Strade sterrate",null,null,0.04,null,null,"Apr",{"$f":"J15","v":0.22}]
[5,"Bosco di conifere d'inverno",null,null,7.0000000000000007E-2,null,null,"Mag",{"$f":"J15","v":0.22}]
[6,"Bosco in autunno, campi",null,null,0.26,null,null,"Giu",{"$f":"J15","v":0.22}]
[7,"Asfalto",null,null,0.1,null,null,"Lug",{"$f":"J16","v":0.22}]
[8,"Calcestruzzo",null,null,0.22,null,null,"Ago",{"$f":"J16","v":0.22}]
[9,"Foglie morte",null,null,0.3,null,null,"Set",{"$f":"J16","v":0.22}]
[10,"Erba secca",null,null,0.2,null,null,"Ott",{"$f":"J17","v":0.22}]
[11,"Erba verde",null,null,0.26,null,null,"Nov",{"$f":"J17","v":0.22}]
[12,"Tetti o terrazze in bitume",null,null,0.13,null,null,"Dic",{"$f":"J17","v":0.22}]
[13,"Pietrisco",null,null,0.2,null,null,"primavera",8,{"$f":"VLOOKUP(primavera,tabellaterreno,5,FALSE)","v":0.22}]
[14,"Superfici scure di edifici",null,null,0.27,null,null,"estate",8,{"$f":"VLOOKUP(estate,tabellaterreno,5,FALSE)","v":0.22}]
[15,"Superfici chiare di edifici",null,null,0.6,null,null,"autunno",8,{"$f":"VLOOKUP(autunno,tabellaterreno,5,FALSE)","v":0.22}]
[null,null,null,null,null,null,null,"inverno",8,{"$f":"VLOOKUP(inverno,tabellaterreno,5,FALSE)","v":0.22}]

{"sheet":"Tabelle5","index":22,"n_rows":86,"n_cols":14,"rows_kept":86,"cut":false,"hidden":true,"merged":[]}
[null,"Tipo","UnitàMisura","Litri",null,"litri * UM",null,null,null,"testo nel foglio FABB ACS"]
[0,"abitazione S < 35 m2","m2",{"$f":"+ROUND(F2/unita_misura,2)","v":2},"litri/G m2",{"$f":"+(0*unita_misura+50)*num_alloggi","v":50},null,null,null,{"$f":"\"m2/alloggio\"&\" (\"&num_alloggi&\" alloggi)\"","v":"m2/alloggio (1 alloggi)"}]
[1,"abitazione 35 < S < 50 m2","m2",{"$f":"+ROUND(F3/unita_misura,2)","v":0.93},"litri/G m2",{"$f":"+(2.667*unita_misura-43.33)*num_alloggi","v":23.344999999999999},1,"numero alloggi",null,{"$f":"\"m2/alloggio\"&\" (\"&num_alloggi&\" alloggi)\"","v":"m2/alloggio (1 alloggi)"}]
[2,"abitazione 50 < S < 200 m2","m2",{"$f":"+ROUND(F4/unita_misura,2)","v":2.5299999999999998},"litri/G m2",{"$f":"+(1.067*unita_misura+36.67)*num_alloggi","v":63.344999999999999},null,null,null,{"$f":"\"m2/alloggio\"&\" (\"&num_alloggi&\" alloggi)\"","v":"m2/alloggio (1 alloggi)"}]
[3,"abitazione S > 200 m2","m2",{"$f":"+ROUND(F5/unita_misura,2)","v":10},"litri/G m2",{"$f":"+(0*unita_misura+250)*num_alloggi","v":250},null,null,null,{"$f":"\"m2/alloggio\"&\" (\"&num_alloggi&\" alloggi)\"","v":"m2/alloggio (1 alloggi)"}]
[4,null,null,null,null,{"$f":"+D6*unita_misura","v":0}]
[5,"Dormitori, residence, B&B","letti",40,"litri/G per letto",1000,null,null,null,"letti"]
[6,"Hotel fino a 3 stelle","letti",60,"litri/G per letto",1500,null,null,null,"letti"]
[7,"Hotel 4 stelle","letti",80,"litri/G per letto",2000,null,null,null,"letti"]
[8,null,null,null,null,0]
[9,"Ospedale day hospital","letti",10,"litri/G per letto",250,null,null,null,"letti"]
[10,"Ospedale con pernottamento","letti",90,"litri/G per letto",2250,null,null,null,"letti"]
[11,null,null,null,null,0]
[12,"Scuole e istruzione","alunni",0.2,"litri/G per alunno",5,null,null,null,"alunni"]
[13,"Scuole materne e asili nido","bambini",8,"litri/G per bambino",200,null,null,null,"bambini"]
[14,null,null,null,null,0]
[15,"Attività sportive / palestre","docce installate",50,"litri/G doccia installata",1250,null,null,null,"docce"]
[16,"Spogliatori di stabilimenti","docce installate",10,"litri/G doccia installata",250,null,null,null,"docce"]
[17,null,null,null,null,0]
[18,"Uffici","m2",0.2,"litri/G m2",5,null,null,null,"m2"]
[19,null,null,null,null,0]
[20,"Esercizio commerciale con servizi igienici","m2",0.2,"litri/G m2",5,null,null,null,"m2"]
[21,"Ristoranti","coperti",65,"litri/G coperto",1625,null,null,null,"coperti"]
[22,"Catering, self service, bar","coperti",25,"litri/G coperto",625,null,null,null,"coperti"]
[23,null,null,null,null,0]
[24,"Servizio lavanderia","letti",50,"litri/G per letto",1250,null,null,null,"letti"]
[25,"Centri benessere","ospiti",200,"litri/G per ospite",5000,null,null,null,"ospiti"]
[5,{"$f":"VLOOKUP(A28,A2:D27,2,FALSE)","v":"Dormitori, residence, B&B"},{"$f":"VLOOKUP(A28,A2:D27,3,FALSE)","v":"letti"},{"$f":"VLOOKUP(A28,A2:D27,4,FALSE)","v":40},{"$f":"VLOOKUP(A28,A2:E27,5,FALSE)","v":"litri/G per letto"},{"$f":"VLOOKUP(A28,A2:F27,6,FALSE)","v":1000},25,"NO",12300,{"$f":"VLOOKUP(A28,A2:J27,10,FALSE)","v":"letti"}]
[null,null,null,null,null,"litri * UM","UM","Altro SI/NO","Altro:"]
[]
[null,"K tubo",0.4]
[null,"Tamb.",18.4583333333333,{"$f":"+AVERAGE('UNI8477'!E20:P20)","v":13.458333333333334}]
[null,"Tdistrib.",48]
[null,"Lunghezza ricircolo",10,null,null,null,"Valore da usare:",{"$f":"+ROUND(IF(H28=\"SI\",I28,F28),0)","v":1000},"litri/giorno"]
[null,"Ore ricircolo",6]
[null,"Ricircolo",true,"Fabbisogno giornaliero per ricircolo:",null,null,{"$f":"k_ricircolo*lung_ricircolo*(tdistrib_ricircolo-tamb_ricircolo)*ore_ricircolo","v":709.0000000000008},"Wh al giorno"]
[null,null,null,"Fabbisogno per ricircolo da usare:",null,null,{"$f":"+G36*C36","v":709.0000000000008},"Wh"]
[null,"temperature utilizzo",{"$f":"+fabb_ACS!L5","v":40},null,"Energia necessaria"]
[null,"temperature entrata",{"$f":"+AVERAGE('UNI8477'!E20:P20)","v":13.458333333333334},"est",{"$f":"H34*(C38-C39)*4186/3600/1000","v":30.862060185185182},"kWh"]
[null,null,{"$f":"+C39","v":13.458333333333334},"inv.",{"$f":"H34*(C38-C40)*4186/3600/1000","v":30.862060185185182},"kWh"]
[]
[]
[null,"Energia","gg","%",null,null,"en/gg","ricircolo","litri/giorno"]
[null,"gen",31,{"$f":"+fabb_ACS!C14","v":100},{"$f":"+D44*C44*$E$40/100","v":956.72386574074062},"kWh",{"$f":"E44/C44","v":30.862060185185182},{"$f":"+$G$37/1000*C44*D44/100","v":21.979000000000024},{"$f":"+$H$34*D44/100","v":1000}]
[null,"feb",28,{"$f":"+fabb_ACS!D14","v":100},{"$f":"+D45*C45*$E$40/100","v":864.13768518518509},"kWh",{"$f":"E45/C45","v":30.862060185185182},{"$f":"+$G$37/1000*C45*D45/100","v":19.852000000000022},{"$f":"+$H$34*D45/100","v":1000}]
[null,"mar",31,{"$f":"+fabb_ACS!E14","v":100},{"$f":"+D46*C46*$E$40/100","v":956.72386574074062},"kWh",30.862060185185182,21.979000000000024,1000]
[null,"apr",30,{"$f":"+fabb_ACS!F14","v":100},{"$f":"+D47*C47*$E$39/100","v":925.86180555555552},"kWh",30.862060185185182,21.270000000000024,1000]
[null,"mag",31,{"$f":"+fabb_ACS!G14","v":100},956.72386574074062,"kWh",30.862060185185182,21.979000000000024,1000]
[null,"giu",30,{"$f":"+fabb_ACS!H14","v":100},{"$f":"+D49*C49*$E$39/100","v":925.86180555555552},"kWh",30.862060185185182,21.270000000000024,1000]
[null,"lug",31,{"$f":"+fabb_ACS!I14","v":100},956.72386574074062,"kWh",30.862060185185182,21.979000000000024,1000]
[null,"ago",31,{"$f":"+fabb_ACS!J14","v":100},956.72386574074062,"kWh",30.862060185185182,21.979000000000024,1000]
[null,"set",30,{"$f":"+fabb_ACS!K14","v":100},925.86180555555552,"kWh",30.862060185185182,21.270000000000024,1000]
[null,"ott",31,{"$f":"+fabb_ACS!L14","v":100},{"$f":"+D53*C53*$E$40/100","v":956.72386574074062},"kWh",30.862060185185182,21.979000000000024,1000]
[null,"nov",30,{"$f":"+fabb_ACS!M14","v":100},{"$f":"+D54*C54*$E$40/100","v":925.86180555555552},"kWh",30.862060185185182,21.270000000000024,1000]
[null,"dic",31,{"$f":"+fabb_ACS!N14","v":100},{"$f":"+D55*C55*$E$40/100","v":956.72386574074062},"kWh",30.862060185185182,21.979000000000024,{"$f":"+$H$34*D55/100","v":1000}]
[null,null,null,null,null,null,null,{"$f":"SUM(H44:H55)","v":258.78500000000025}]
[]
[]
[]
[]
[]
[]
[null,"Profili di utilizzo","gen","feb","mar","apr","mag","giu","lug","ago","set","ott","nov","dic"]
[1,"condominio",100,100,90,90,80,80,75,80,80,90,90,100]
[2,"casa",100,100,90,90,80,80,75,80,80,90,100,100]
[3,"uffici",100,100,100,100,90,85,80,85,90,100,100,100]
[4,"negozi",90,90,85,75,75,65,60,65,70,75,80,100]
[5,"sempre 100%",100,100,100,100,100,100,100,100,100,100,100,100]
[6,"personalizzato"]
[5,{"$f":"VLOOKUP($A$70,$A$64:$N$69,2,FALSE)","v":"sempre 100%"},{"$f":"VLOOKUP($A$70,$A$64:$N$68,3,FALSE)","v":100},{"$f":"VLOOKUP($A$70,$A$64:$N$68,4,FALSE)","v":100},{"$f":"VLOOKUP($A$70,$A$64:$N$68,5,FALSE)","v":100},{"$f":"VLOOKUP($A$70,$A$64:$N$68,6,FALSE)","v":100},{"$f":"VLOOKUP($A$70,$A$64:$N$68,7,FALSE)","v":100},{"$f":"VLOOKUP($A$70,$A$64:$N$68,8,FALSE)","v":100},{"$f":"VLOOKUP($A$70,$A$64:$N$68,9,FALSE)","v":100},{"$f":"VLOOKUP($A$70,$A$64:$N$68,10,FALSE)","v":100},{"$f":"VLOOKUP($A$70,$A$64:$N$68,11,FALSE)","v":100},{"$f":"VLOOKUP($A$70,$A$64:$N$68,12,FALSE)","v":100},{"$f":"VLOOKUP($A$70,$A$64:$N$68,13,FALSE)","v":100},{"$f":"VLOOKUP($A$70,$A$64:$N$68,14,FALSE)","v":100}]
[]
[]
[null,"Profili di utilizzo","descrizione","ore 9","ore 11","0re 14","0re 20"]
[1,"distribuito (25% ore 11 - 25% ore 14 - 50% ore 20)","distribuito",0,25,25,50]
[2,"prevalentemente serale (25% ore 14 - 75% ore 20)","serale",0,0,25,75]
[3,"personalizzato","personalizzato",0,30,50,20,{"$f":"SUM(D76:G76)","v":100},"(testo di una form)"]
[4]
[5]
[2,{"$f":"VLOOKUP($A$79,$A$74:$B$78,2,FALSE)","v":"prevalentemente serale (25% ore 14 - 75% ore 20)"},{"$f":"VLOOKUP($A$79,$A$74:$C$78,3,FALSE)","v":"serale"},{"$f":"VLOOKUP($A$79,$A$74:$G$78,4,FALSE)","v":0},{"$f":"VLOOKUP($A$79,$A$74:$G$78,5,FALSE)","v":0},{"$f":"VLOOKUP($A$79,$A$74:$G$78,6,FALSE)","v":25},{"$f":"VLOOKUP($A$79,$A$74:$G$78,7,FALSE)","v":75}]
[]
[]
[null,"gen","feb","mar","apr","mag","giu","lug","ago","set","ott","nov","dic"]
["ore9",{"$f":"+$I44*D$79/100","v":0},{"$f":"+$I45*D$79/100","v":0},{"$f":"+$I46*D$79/100","v":0},{"$f":"+$I47*D$79/100","v":0},{"$f":"+$I48*D$79/100","v":0},{"$f":"+$I49*D$79/100","v":0},{"$f":"+$I50*D$79/100","v":0},{"$f":"+$I51*D$79/100","v":0},{"$f":"+$I52*D$79/100","v":0},{"$f":"+$I53*D$79/100","v":0},{"$f":"+$I54*D$79/100","v":0},{"$f":"+$I55*D$79/100","v":0}]
["ore11",{"$f":"+$I44*E$79/100","v":0},{"$f":"+$I45*E$79/100","v":0},{"$f":"+$I46*E$79/100","v":0},{"$f":"+$I47*E$79/100","v":0},{"$f":"+$I48*E$79/100","v":0},{"$f":"+$I49*E$79/100","v":0},{"$f":"+$I50*E$79/100","v":0},{"$f":"+$I51*E$79/100","v":0},{"$f":"+$I52*E$79/100","v":0},{"$f":"+$I53*E$79/100","v":0},{"$f":"+$I54*E$79/100","v":0},{"$f":"+$I55*E$79/100","v":0}]
["ore14",{"$f":"+$I44*F$79/100","v":250},{"$f":"+$I45*F$79/100","v":250},{"$f":"+$I46*F$79/100","v":250},{"$f":"+$I47*F$79/100","v":250},{"$f":"+$I48*F$79/100","v":250},{"$f":"+$I49*F$79/100","v":250},{"$f":"+$I50*F$79/100","v":250},{"$f":"+$I51*F$79/100","v":250},{"$f":"+$I52*F$79/100","v":250},{"$f":"+$I53*F$79/100","v":250},{"$f":"+$I54*F$79/100","v":250},{"$f":"+$I55*F$79/100","v":250}]
["ore20",{"$f":"+$I44*G$79/100","v":750},{"$f":"+$I45*G$79/100","v":750},{"$f":"+$I46*G$79/100","v":750},{"$f":"+$I47*G$79/100","v":750},{"$f":"+$I48*G$79/100","v":750},{"$f":"+$I49*G$79/100","v":750},{"$f":"+$I50*G$79/100","v":750},{"$f":"+$I51*G$79/100","v":750},{"$f":"+$I52*G$79/100","v":750},{"$f":"+$I53*G$79/100","v":750},{"$f":"+$I54*G$79/100","v":750},{"$f":"+$I55*G$79/100","v":750}]

{"sheet":"bollitore","index":23,"n_rows":72,"n_cols":11,"rows_kept":72,"cut":false,"hidden":true,"merged":[]}
[]
[]
[null,null,"V (litri)","K (W/K)","Vbu/Vnom",null,"Vbu"]
[0,"Aqua 200",216,1.22,{"$f":"+G4/C4","v":0.32870370370370372},null,71]
[1,"Aqua 300",310,1.47,{"$f":"+G5/C5","v":0.41935483870967744},null,130]
[2,"Aqua 400",428,1.56,{"$f":"+G6/C6","v":0.39018691588785048},null,167]
[3,"Aqua 500",543,1.64,{"$f":"+G7/C7","v":0.40883977900552487},null,222]
[4,"AquaSunPlus 200",212,1.49,{"$f":"+G8/C8","v":0.44811320754716982},null,95]
[5,"AquaSunPlus 300",297,1.82,0.39393939393939392,null,117]
[6,"AquaSunPlus 400",419,2.13,0.36515513126491644,null,153]
[7,"AquaSunPlus 500",513,2.27,0.42495126705653019,null,218]
[8,"AquaSunPlus 900",885,2.69,0.51864406779661021,null,459]
[9,"AquaSun 1500",1494,3.11,0.46251673360107093,null,691]
[10,"AquaSun 2000",2013,3.64,0.46696472925981125,null,940]
[11,"AquaSun 300 A",297,1.07,{"$f":"+G15/C15","v":0.29966329966329969},null,89]
[12]
[13,"AquaSun PDC 300",299,1.93,{"$f":"+G17/C17","v":1},null,299]
[14,"AquaSun PDC 500",509,2.56,{"$f":"+G18/C18","v":1},null,509]
[15,"AquaSun PDC 900",883,2.73,{"$f":"+G19/C19","v":1},null,883]
[16,"RLH 300 B",315,1.42,{"$f":"+G20/C20","v":0.92698412698412702},null,292]
[17,"RLH 500 B",465,1.6,{"$f":"+G21/C21","v":0.91827956989247317},null,427]
[18]
[19,"Bollitore SR 500",496,2.38,{"$f":"+G23/C23","v":0.98185483870967738},null,487]
[20,"Bollitore SR 1000",910,3.13,{"$f":"+G24/C24","v":0.98241758241758237},null,894]
[21,"Bollitore SR 1500",1526,3.8,{"$f":"+G25/C25","v":0.9370904325032765},null,1430]
[22]
[23,"Aqua Expresso III 500",500,1.82,{"$f":"+G27/C27","v":0.60399999999999998},null,302]
[24,"Aqua Expresso III 650",636,2,{"$f":"+G28/C28","v":0.50943396226415094},null,324]
[25,"Aqua Expresso III 800",815,2.1800000000000002,{"$f":"+G29/C29","v":0.50920245398773001},null,415]
[26,"Aqua Expresso III 1000",1047,2.38,{"$f":"+G30/C30","v":0.46800382043935052},null,490]
[27,"Aqua Expresso III 800 HF",805,2.1800000000000002,{"$f":"+G31/C31","v":0.71055900621118018},null,572]
[28]
[29,"Titan 400 Aqua",394,2.29,{"$f":"+G33/C33","v":0.64213197969543145},null,253]
[30,"Titan 400",394,2.33,{"$f":"+G34/C34","v":0.64213197969543145},null,253]
[31]
[32,"R / RR 500",512,2.31,{"$f":"+G36/C36","v":0.525390625},null,269]
[33,"R / RR 750",772,2.87,{"$f":"+G37/C37","v":0.55699481865284972},null,430]
[34,"R / RR 1000",926,3.16,{"$f":"+G38/C38","v":0.52915766738660908},null,490]
[35,"R / RR 1500",1526,3.8,{"$f":"+G39/C39","v":0.55635648754914813},null,849]
[36]
[37,"Accumulo P / PR 500",512,2.31,{"$f":"+G41/C41","v":0.525390625},null,269]
[38,"Accumulo P / PR 800",772,2.87,{"$f":"+G42/C42","v":0.55699481865284972},null,430]
[39,"Accumulo P / PR 1000",926,3.16,{"$f":"+G43/C43","v":0.52915766738660908},null,490]
[40,"Accumulo P / PR 1500",1526,3.8,{"$f":"+G44/C44","v":0.55635648754914813},null,849]
[41]
[42,"PS 1500",1489,3.78,{"$f":"+G46/C46","v":0.70382807253190061},null,1048,{"$f":"+G46/C46","v":0.70382807253190061}]
[43,"PS 2000",2015,4.2,0.70299999999999996,null,{"$f":"0.703*C47","v":1416.5449999999998}]
[44,"PS 3000",3000,4.5999999999999996,0.70299999999999996,null,2109]
[45,"PS 4000",4000,5.3,0.70299999999999996,null,2812]
[46,"PS 5000",5000,6.3,0.70299999999999996,null,3515]
[47,"PS 6000",6000,6.7,0.70299999999999996,null,4218]
[48,"PS 7000",7000,7.1,0.70299999999999996,null,4921]
[49,"PS 8000",8000,7.5,0.70299999999999996,null,5624]
[50]
[51,"Bollitore Libravario Aqua",178,1.33,{"$f":"+G55/C55","v":0.6179775280898876},null,110]
[52]
[]
[23,{"$f":"VLOOKUP(A58,A4:D56,2,FALSE)","v":"Aqua Expresso III 500"},{"$f":"VLOOKUP(A58,A4:D56,3,FALSE)","v":500},{"$f":"VLOOKUP(A58,A4:D56,4,FALSE)","v":1.82},1,{"$f":"+E58*C58","v":500},false,1500,{"$f":"+IF(G58=FALSE,F58,H58*numerobollitori)","v":500},{"$f":"+IF(G58=FALSE,D58,H69)","v":1.82},{"$f":"+IF(G58=FALSE,B58,\"Altro bollitore\")","v":"Aqua Expresso III 500"}]
[null,null,"Vbu/Vnom",{"$f":"VLOOKUP(A58,A4:E56,5,FALSE)","v":0.60399999999999998},"numero","volume","altro","volume","volume","K","descrizione"]
[null,null,null,null,"bollitori",null,null,"inserito","da usare","da usare","da usare"]
[]
[]
[null,null,null,null,null,null,null,"??"]
[null,null,null,null,null,null,null,"??"]
[null,null,null,null,null,null,null,"??"]
[]
[null,null,null,null,null,null,null,"??"]
[null,null,null,null,null,null,null,"??"]
[null,null,null,null,null,null,"K",4,"W/K"]
[]
[]
[null,null,null,null,null,null,null,20,"temperatura centrale termica"]

{"sheet":"Tabelle6","index":24,"n_rows":73,"n_cols":16,"rows_kept":73,"cut":false,"hidden":true,"merged":[]}
["verificato"]
[null,null,null,null,null,null,null,null,null,null,null,"Fattore conversione in energia primaia"]
[null,"Tipo","Rend.","Rend. ACS","Combust.","prezzo",null,null,"potere",null,"kg CO2 su unità","fp tot","€/kWh","fp nren","fp ren","PDC?"]
[1,"Caldaia a condens. 4*",91,90,"metano",0.85,"€ / m3","m3 di metano",9500,"Wh/m3",1.97,1.05,{"$f":"+F4/I4*1000","v":8.9473684210526316E-2},1.05,0,false]
[2,"Caldaia 3*",87,86,"metano",0.85,"€ / m3","m3 di metano",9500,"Wh/m3",1.97,1.05,8.9473684210526316E-2,1.05,0,false]
[3,"Pompa di calore aria-acqua",390,210,"elettricità",0.2,"€ / kWh el","kWh el",1000,"Wh/kWh el",0.41,2.42,0.2,1.95,0.47,true]
[4,"Caldaia a gasolio, monostadio",85,80,"gasolio",1.25,"€ / litro","litri di gasolio",9800,"Wh/litro",2.66,1.07,0.12755102040816327,1.07,0,false]
[5,"Caldaia a GPL",85,80,"gpl",1.1499999999999999,"€ / litro","litri di GPL",6900,"Wh/litro",1.73,1.05,0.16666666666666666,1.05,0,false]
[6,"Caldaia a pellet",85,85,"pellet",0.2,"€ / kg","kilogrammi di pellet",4800,"Wh/kilogr.",0,1,4.1666666666666671E-2,0.2,0.8,false]
[1,{"$f":"VLOOKUP(A10,A4:D9,2,FALSE)","v":"Caldaia a condens. 4*"},{"$f":"VLOOKUP(A10,A4:D9,3,FALSE)","v":91},{"$f":"VLOOKUP(A10,A4:D9,4,FALSE)","v":90},{"$f":"VLOOKUP(A10,A4:E9,5,FALSE)","v":"metano"},{"$f":"VLOOKUP(A10,A4:F9,6,FALSE)","v":0.85},{"$f":"VLOOKUP(A10,A4:G9,7,FALSE)","v":"€ / m3"},"proposte dal programma",{"$f":"VLOOKUP(A10,A4:I9,9,FALSE)","v":9500},null,{"$f":"VLOOKUP(A10,A4:K9,11,FALSE)","v":1.97},{"$f":"VLOOKUP(A10,A4:L9,12,FALSE)","v":1.05},null,{"$f":"VLOOKUP(A10,A4:O9,14,FALSE)","v":1.05},{"$f":"VLOOKUP(A10,A4:O9,15,FALSE)","v":0},{"$f":"VLOOKUP(A10,A4:P9,16,FALSE)","v":false}]
[null,"Inserito",91,90,null,"0,85",null,"usate nel calcolo: inserite dall'utente oppure proposte dal programma"," "]
[]
["tasso","tasso"]
["proposto","inserito"]
[4,4,null,null,null,null,null,null,null,null,"per COP acs da usare nel foglio \"cti\", l'utente inserisce il COPN a 55/7"]
[null,null,null,null,null,null,null,null,null,null,"con questi coefficienti (tratti dalle nostre pdc) si trasfroma questo COP alle altre temperature esterne"]
[null,null,null,null,null,null,null,null,null,null,"t.ext","coeff","COPN(t.ext)"]
[null,"energia ACS",{"$f":"+riepilogo!J21","v":6552.549699706},"kWh / anno",{"$f":"+C18*1000/I10/(cti!E16)","v":766.38008183695911},null,null,null,null,null,-15,0.5243822690899218,{"$f":"+L18*$D$11","v":47.194404218092963}]
[null,"energia RISC+PISC",{"$f":"+riepilogo!L21","v":0},"kWh / anno",{"$f":"+C19*1000/I10/(cti!E57)","v":0},null,"CO2 kg",null,null,null,-14,0.53650225835326881,{"$f":"+L19*$D$11","v":48.285203251794194}]
[null,null,null,null,{"$f":"ROUND(SUM(E18:E19),0)","v":766},{"$f":"VLOOKUP(A10,A4:H9,8,FALSE)","v":"m3 di metano"},{"$f":"+comb_evitato*K10","v":1509.02},null,null,null,-13,0.54903096798372464,49.412787118535221]
[null,null,null,null,{"$f":"+E20*F11","v":651.1},"euro",null,null,null,null,-12,0.56196123490947403,50.576511141852663]
[null,null,null,null,null,null,null,null,null,null,-11,0.57528756269131631,51.775880642218468]
[null,null,null,null,null,null,null,null,null,null,-10,0.58856787388196685,52.971108649377015]
[null,"potenza caldaia per poduzione acs",9,"kW",null,null,null,null,null,null,-9,0.60189585312712324,54.170626781441094]
[null,null,null,null,null,null,null,null,null,null,-8,0.61507896421282338,55.357106779154101]
[null,null,null,null,null,null,null,null,null,null,-7,0.63123038176432766,56.810734358789489]
[null,null,null,null,null,null,null,null,null,null,-6,0.64261148251662426,57.835033426496182]
[null,null,null,null,null,null,null,null,null,null,-5,0.65698208341661968,59.128387507495773]
[null,null,null,null,null,null,null,null,null,null,-4,0.67123997710063432,60.411597939057089]
[null,null,null,null,null,null,null,null,null,null,-3,0.70136596456749878,63.122936811074894]
[null,null,null,null,null,null,null,null,null,null,-2,0.7314433370306811,65.829900332761298]
[null,null,null,null,null,null,null,null,null,null,-1,0.7614723900288245,68.532515102594203]
[null,null,null,null,null,null,null,null,null,null,0,0.7914534167099001,71.230807503891015]
[null,null,null,null,null,null,null,null,null,null,1,0.82138670785532997,73.924803706979702]
[null,null,null,null,null,null,null,null,null,null,2,0.85127255190382167,76.614529671343945]
[null,null,null,null,null,null,null,null,null,null,3,0.88111123497491339,79.300011147742211]
[null,null,null,null,null,null,null,null,null,null,4,0.91090304089223562,81.9812736803012]
[null,null,null,null,null,null,null,null,null,null,5,0.94064825120649476,84.658342608584533]
[null,null,null,null,null,null,null,null,null,null,6,0.97034714521818022,87.331243069636216]
[null,null,null,null,null,null,null,null,null,null,7,1,90]
[null,null,null,null,null,null,null,null,null,null,8,1.0391361180567116,93.522250625104036]
[null,null,null,null,null,null,null,null,null,null,9,1.080008470445208,97.200762340068721]
[null,null,null,null,null,null,null,null,null,null,10,1.1226603241498716,101.03942917348844]
[null,null,null,null,null,null,null,null,null,null,11,1.1671138785812942,105.04024907231648]
[null,null,null,null,null,null,null,null,null,null,12,1.2133930922878433,109.2053783059059]
[null,null,null,null,null,null,null,null,null,null,13,1.2615238065476593,113.53714258928933]
[null,null,null,null,null,null,null,null,null,null,14,1.3115338834933699,118.03804951440328]
[null,null,null,null,null,null,null,null,null,null,15,1.3634533603152053,122.71080242836847]
[null,null,null,null,null,null,null,null,null,null,16,1.4173146213282617,127.55831591954355]
[null,null,null,null,null,null,null,null,null,null,17,1.4731525899651874,132.58373309686687]
[null,null,null,null,null,null,null,null,null,null,18,1.5310049430732822,137.79044487659539]
[null,null,null,null,null,null,null,null,null,null,19,1.5909123502632458,143.18211152369213]
[null,null,null,null,null,null,null,null,null,null,20,1.6529187414852864,148.76268673367576]
[null,null,null,null,null,null,null,null,null,null,21,1.7170716065089109,154.53644458580197]
[null,null,null,null,null,null,null,null,null,null,22,1.7834223305698238,160.50800975128413]
[null,null,null,null,null,null,null,null,null,null,23,1.8520265711383683,166.68239140245316]
[null,null,null,null,null,null,null,null,null,null,24,1.9229446815802635,173.06502134222373]
[null,null,null,null,null,null,null,null,null,null,25,1.9962421884481387,179.66179696033248]
[null,null,null,null,null,null,null,null,null,null,26,2.0719903302938705,186.47912972644835]
[null,null,null,null,null,null,null,null,null,null,27,2.1502666672669095,193.52400005402185]
[null,null,null,null,null,null,null,null,null,null,28,2.2311557724123077,200.80401951710769]
[null,null,null,null,null,null,null,null,null,null,29,2.3147500175660296,208.32750158094265]
[null,null,null,null,null,null,null,null,null,null,30,2.4011504691422454,216.10354222280208]
[null,null,null,null,null,null,null,null,null,null,31,2.4904679120156215,224.14211208140594]
[null,null,null,null,null,null,null,null,null,null,32,2.5828240232457476,232.45416209211729]
[null,null,null,null,null,null,null,null,null,null,33,2.6783527217288503,241.05174495559652]
[null,null,null,null,null,null,null,null,null,null,34,2.7772017251970866,249.9481552677378]
[null,null,null,null,null,null,null,null,null,null,35,2.8795343525791539,259.15809173212386]
[null,null,null,null,null,null,null,null,null,null,36,2.985531617926676,268.69784561340083]
[null,null,null,null,null,null,null,null,null,null,37,3.0953946723407952,278.58552051067159]
[null,null,null,null,null,null,null,null,null,null,38,3.2093476631827542,288.84128968644791]
[null,null,null,null,null,null,null,null,null,null,39,3.3276410960885117,299.48769864796606]
[null,null,null,null,null,null,null,null,null,null,40,3.4505558059521113,310.55002253569]

{"sheet":"CT20","index":25,"n_rows":25,"n_cols":18,"rows_kept":25,"cut":false,"hidden":true,"merged":[[0,3,0,4],[0,5,0,6],[0,7,0,8],[8,2,8,6]]}
[null,null,"Ag","Qcol (kWh)",null,"Qu (kWh/m2)",null,"Sl",null,"Qu * Sl (kWh)"]
[null,null,"Sup lorda m2","50°C","75°C","50°C","75°C","nr","m2","50°C","75°C",null,null,null,null,"Dal foglio \"Tabelle\""]
[1,"STAR 15/39",3.93,2313,1997,{"$f":"D3/C3","v":588.54961832061065},{"$f":"E3/C3","v":508.1424936386768},{"$f":"+superficie/L3","v":2.2857142857142856},{"$f":"H3*C3","v":8.9828571428571422},{"$f":"+I3*F3","v":5286.8571428571422},{"$f":"+I3*G3","v":4564.5714285714275},3.5,null,null,null,1,"Star"]
[2,"CSO21",2.38,1201,1004,{"$f":"D4/C4","v":504.62184873949582},{"$f":"E4/C4","v":421.84873949579833},{"$f":"+superficie/L4","v":6.0150375939849621},{"$f":"H4*C4","v":14.315789473684209},{"$f":"+I4*F4","v":7224.060150375939},{"$f":"+I4*G4","v":6039.0977443609017},1.33,null,null,null,2,"CSO 21"]
[3,"PLASMA 15/40",3.99,2568,2316,{"$f":"D5/C5","v":643.60902255639098},{"$f":"E5/C5","v":580.45112781954879},{"$f":"+superficie/L5","v":2.2857142857142856},{"$f":"H5*C5","v":9.1199999999999992},{"$f":"+I5*F5","v":5869.7142857142853},{"$f":"+I5*G5","v":5293.7142857142844},3.5,null,null,null,3,"AQUA PLASMA"]
[4,"EasySun II",2.15,938,544,{"$f":"D6/C6","v":436.27906976744185},{"$f":"E6/C6","v":253.02325581395351},{"$f":"+superficie/L6","v":4},{"$f":"H6*C6","v":8.6},{"$f":"+I6*F6","v":3752},{"$f":"+I6*G6","v":2176},2,null,null,null,4,"EasySun II"]
[{"$f":"+pannelloscelto","v":3},null,null,null,null,null,null,null,{"$f":"+VLOOKUP(A7,A3:I6,9,FALSE)","v":9.1199999999999992},{"$f":"+VLOOKUP(A7,A3:K6,10,FALSE)","v":5869.7142857142853},{"$f":"+VLOOKUP(A7,A3:K6,11,FALSE)","v":5293.7142857142844},null,null,null,null,{"$f":"+pannelloscelto","v":3},null,"pannello scelto"]
[]
[null,null,"superficie lorda",null,null,null,null,null,null,null,null,null,null,null,null,"Dal foglio \"Incentivi\""]
[null,"Ci     incentivo annuo €/kWh","fino a 12","da 12,1 a 50","da 50,1 a 200","da 200,1 a 500","oltre 500",null,null,null,null,null,null,null,null,1,"Detrazioni fiscali per efficienza energetica (65%)"]
[null,"Per ACS  @50°C",0.35,0.32,0.1,0.09,0.08,null,null,null,null,null,null,null,null,2,"Detrazioni fiscali per ristrutturazione (50%)"]
[null,"Per ACS, Risc @50°C",0.36,0.33,0.11,0.1,0.09,null,null,null,null,null,null,null,null,3,"Conto energia 2.0 per ACS"]
[null,"Per Processo BT, TLR @75°C",0.36,0.33,0.11,0.1,0.09,null,null,null,null,null,null,null,null,4,"Conto energia 2.0 per ACS, riscaldamento"]
[null,"Per Solar Cooling @75°C",0.43,0.39,0.13,0.12,0.11,null,null,null,null,null,null,null,null,5,"Conto energia 2.0 per calore di processo"]
[null,null,null,null,null,null,null,null,null,null,null,null,null,null,null,6,"Conto energia 2.0 per solar cooling"]
[null,null,null,null,"incentivo annuo totale",null,null,null,null,null,null,null,null,null,null,7,"Altro"]
[null,null,null,"Ci","Qu","Ia tot",null,null,null,null,null,null,null,null,null,{"$f":"+incentivi!C11","v":3},null,"incentivo scelto"]
[null,1,"Per ACS ",{"$f":"+IF($I$7<=12,C11,IF($I$7<=50,D11,IF($I$7<=200,E11,IF($I$7<=500,F11,G11))))","v":0.35},{"$f":"+J7","v":5869.7142857142853}]
[null,2,"Per ACS e riscaldamento",{"$f":"+IF($I$7<=12,C12,IF($I$7<=50,D12,IF($I$7<=200,E12,IF($I$7<=500,F12,G12))))","v":0.36},{"$f":"+J7","v":5869.7142857142853}]
[null,3,"Per calore processo BT",{"$f":"+IF($I$7<=12,C13,IF($I$7<=50,D13,IF($I$7<=200,E13,IF($I$7<=500,F13,G13))))","v":0.36},{"$f":"+K7","v":5293.7142857142844}]
[null,4,"Per Solar Cooling",{"$f":"+IF($I$7<=12,C14,IF($I$7<=50,D14,IF($I$7<=200,E14,IF($I$7<=500,F14,G14))))","v":0.43},{"$f":"+K7","v":5293.7142857142844}]
[null,{"$f":"+P17-2","v":1},{"$f":"+VLOOKUP(B22,B18:C21,2,FALSE)","v":"Per ACS "},{"$f":"+VLOOKUP(B22,B18:D21,3,FALSE)","v":0.35},{"$f":"+VLOOKUP(B22,B18:E21,4,FALSE)","v":5869.7142857142853},{"$f":"+E22*D22","v":2054.3999999999996}]
[]
[null,null,null,"Numero rate:",{"$f":"+IF(I7<=50,2,5)","v":2}]
[null,null,null,"Incentivo totale",{"$f":"+E24*F22","v":4108.7999999999993}]

{"sheet":"Tabelle UNI","index":26,"n_rows":105,"n_cols":77,"rows_kept":105,"cut":false,"hidden":true,"merged":[[1,48,1,49],[1,58,1,59],[1,60,1,61],[1,50,1,51],[1,52,1,53],[1,54,1,55],[1,56,1,57],[2,25,3,25],[2,27,3,27],[2,29,2,30],[2,31,2,32],[1,46,1,47],[1,42,1,43],[1,44,1,45],[2,35,3,35],[2,37,3,37],[1,38,1,39],[1,40,1,41],[0,0,0,15],[0,17,0,23],[2,17,3,17],[2,19,3,19],[2,0,3,0],[2,2,3,2]]}
["Prospetto VI - Valori medi mensili della temperatura media giornaliera dell'aria esterna",null,null,null,null,null,null,null,null,null,null,null,null,null,null,null,null,"Prospetto XIV - Velocità giornaliera del vento - Media annuale",null,null,null,null,null,null,null,"Latitudine"]
[null,null,null,null,null,null,null,null,null,null,null,null,null,null,null,null,null,null,null,null,null,null,null,null,null,null,null,null,null,null,null,null,null,null,null,null,null,null,"GEN.",null,"FEB.",null,"MAR.",null,"APR.",null,"MAG.",null,"GIU.",null,"LUG.",null,"AGO.",null,"SET.",null,"OTT.",null,"NOV.",null,"DIC."]
["N°","Sigla","Località","Altitudine","GEN.","FEB.","MAR.","APR.","MAG.","GIU.","LUG.","AGO."," SET.","OTT.","NOV.","DIC.",null,"N°","Sigla","Località","Altitudine","Zona di","w","Direzione",null,"N°","Sigla","Località","Altitudine","Latitudine",null,"Longitudine",null,"T min ext",null,"N°","Sigla","Località","Hd h","Hb h","Hd h","Hb h","Hd h","Hb h","Hd h","Hb h","Hd h","Hb h","Hd h","Hb h","Hd h","Hb h","Hd h","Hb h","Hd h","Hb h","Hd h","Hb h","Hd h","Hb h","Hd h","Hb h"]
[null,"Provincia",null,"m","°C","°C","°C","°C","°C","°C","°C","°C","°C","°C","°C","°C",null,null,"Provincia",null,"m","vento","m/s","prevalente",null,null,"Provincia",null,"m","°","  '","°","  '",null,null,null,"Prov",null,"MJ/m2","MJ/m2","MJ/m2","MJ/m2","MJ/m2","MJ/m2","MJ/m2","MJ/m2","MJ/m2","MJ/m2","MJ/m2","MJ/m2","MJ/m2","MJ/m2","MJ/m2","MJ/m2","MJ/m2","MJ/m2","MJ/m2","MJ/m2","MJ/m2","MJ/m2","MJ/m2","MJ/m2",null,"COMUNE","ZonaClimat","PeriodoRis","GradGiorno",null,"COMUNE","ProvSigla","UmRelEST",null,null,"TEMP.MAX.ESTIVA"]
[1,"AG","Agrigento",230,10.4,10.8,12.7,15.6,19.399999999999999,24.1,26.9,26.5,24,19.899999999999999,15.9,12.2,null,1,"AG","Agrigento",230,"3",4.5,"NW",null,1,"AG","Agrigento",230,"37","18","13","35",3,null,1,"AG","Agrigento",3.4,"5,4","4,2","8,3","5,3","11,6","6,2","16,0","6,3","20,6","6,0","23,5","5,4","24,2","4,8","22,2","4,9","16,0","4,3","10,3","3,5","6,6","3,0","5,2",1,"AGRIGENTO","B",121,729,1,"AGRIGENTO","AG",59.8,null,null,1,"AG","Agrigento","33,0"]
[2,"AL","Alessandria",95,0,2.8,8.1,13.1,17.3,22,24.7,23.6,19.899999999999999,13.1,6.9,1.9,null,2,"AL","Alessandria",95,"1",1.2,"SE",null,2,"AL","Alessandria",95,"44","54","8","36",-8,null,2,"AL","Alessandria",2.4,"2,3","3,5","4,0","5,1","6,5","6,7","9,1","7,9","10,6","8,4","12,1","7,7","14,9","7,0","11,0","5,6","7,8","4,0","4,5","2,7","2,6","2,1","2,1",2,"ALESSANDRIA","E",183,2559,2,"ALESSANDRIA","AL",44.4,null,null,2,"AL","Alessandria","30,5"]
[3,"AN","Ancona",16,6.3,7.1,9.9,13.4,17,21.8,24.4,24.1,21.3,16.5,12.1,7.8,null,3,"AN","Ancona",16,"2",3.2,"W",null,3,"AN","Ancona",16,"43","36","16","30",-2,null,3,"AN","Ancona",2.5,"1,8","3,7","3,9","5,2","6,9","6,6","11,7","7,4","15,7","7,9","16,2","6,9","19,1","6,4","15,6","5,4","10,6","4,1","6,4","2,8","2,7","2,3","1,8",3,"ANCONA","D",166,1688,3,"ANCONA","AN",37,null,null,3,"AN","Ancona","30,1"]
[4,"AO","Aosta",583,-0.3,2.6,6.7,11,14.7,18.7,20.5,19.399999999999999,15.9,10.3,4.8,0.8,null,4,"AO","Aosta",583,"2",2.6,"N",null,4,"AO","Aosta",583,"45","44","7","18",-10,null,4,"AO","Aosta",2.4,"2,9","3,4","4,6","4,9","7,2","6,7","9,0","7,9","10,3","8,4","11,5","8,0","13,0","7,1","10,4","5,6","7,6","3,9","4,8","2,6","3,5","2,1","2,7",4,"AOSTA","E",183,2850,4,"AOSTA","AO",44.4,null,null,4,"AO","Aosta","28,7"]
[5,"AR","Arezzo",246,5.0999999999999996,5.9,9.1999999999999993,12.6,16.399999999999999,20.9,24,23.4,20.3,15,10.199999999999999,6.1,null,5,"AR","Arezzo",246,"2",4.5,"NE",null,5,"AR","Arezzo",246,"43","27","11","52",0,null,5,"AR","Arezzo",2.6,"2,5","3,7","3,9","5,2","6,0","6,9","8,2","8,0","11,2","8,2","14,0","7,7","15,4","7,0","12,2","5,6","9,3","4,2","5,2","2,9","2,9","2,3","1,8",5,"AREZZO","E",183,2104,5,"AREZZO","AR",28.3,null,null,5,"AR","Arezzo","31,5"]
[6,"AP","Ascoli Piceno",154,5.5,6.6,9.5,13.3,17.2,21.7,24.4,24.3,21.1,15.8,10.9,7,null,6,"AP","Ascoli Piceno",154,"1",1.7,"W",null,6,"AP","Ascoli Piceno",154,"42","51","13","34",-2,null,6,"AP","Ascoli Piceno",2.8,"2,6","3,8","4,4","5,3","7,3","6,8","10,4","7,8","13,0","8,0","15,7","7,1","18,5","6,3","16,0","5,5","10,8","4,2","6,2","3,0","3,4","2,5","2,3",6,"ASCOLI PICENO","D",166,1698,6,"ASCOLI PICENO","AP",39.799999999999997,null,null,6,"AP","Ascoli Piceno","32,9"]
[7,"AT","Asti",123,-0.4,2.7,7.9,13,17,21.6,24.2,22.9,18.899999999999999,12.7,6.1,1.3,null,7,"AT","Asti",123,"1",1.5,"SW",null,7,"AT","Asti",123,"44","53","8","12",-8,null,7,"AT","Asti",2.5,"2,7","3,5","4,4","5,1","6,9","6,7","9,6","7,9","10,7","8,4","12,2","7,8","14,7","7,1","10,7","5,6","7,5","4,0","5,1","2,7","2,9","2,1","2,7",7,"ASTI","E",183,2617,7,"ASTI","AT",44.4,null,null,7,"AT","Asti","32,1"]
[8,"AV","Avellino",348,5.5,6.5,8.8000000000000007,12.4,16,20.3,23.1,22.6,19.600000000000001,14.8,10.4,6.8,null,8,"AV","Avellino",348,"2",4.4000000000000004,"W",null,8,"AV","Avellino",348,"40","54","14","47",-2,null,8,"AV","Avellino",2.9,"2,5","4,0","4,4","5,5","7,2","6,8","11,3","7,6","14,7","7,8","16,9","6,6","20,3","6,0","17,9","5,4","12,3","4,3","7,7","3,2","3,8","2,6","2,3",8,"AVELLINO","D",166,1742,8,"AVELLINO","AV",48.8,null,null,8,"AV","Avellino","30,1"]
[9,"BA","Bari",5,8.6,9.1999999999999993,11.1,14.2,18,22.3,24.7,24.5,22,17.899999999999999,14,10.199999999999999,null,9,"BA","Bari",5,"2",3.5,"W",null,9,"BA","Bari",5,"41","08","16","50",0,null,9,"BA","Bari","3,0","3,6","3,9","6,2","5,3","9,2","6,3","14,3","6,8","18,5","6,7","21,3","5,9","22,7","5,4","19,8","5,0","14,0","4,0","9,2","3,1","4,9","2,7","3,0",9,"BARI","C",137,1185,9,"BARI","BA",41.7,null,null,9,"BA","Bari","32,3"]
[10,"BL","Belluno",383,0.1,2.2999999999999998,6.8,11.2,14.9,18.899999999999999,21.2,20.8,17.7,12.4,6.5,1.7,null,10,"BL","Belluno",383,"1",0.9,"E",null,10,"BL","Belluno",383,"46","08","12","13",-10,null,10,"BL","Belluno",2.2999999999999998,"2,0","3,4","4,1","4,9","7,0","6,7","8,6","7,9","11,4","8,4","12,1","7,9","14,0","7,0","10,8","5,5","8,4","3,8","5,3","2,5","2,3","2,0","1,9",10,"BELLUNO","E",183,2936,10,"BELLUNO","BL",38.9,null,null,10,"BL","Belluno","31,1"]
[11,"BN","Benevento",135,6.8,7.7,10.3,13.7,17.5,22.1,24.8,24.3,21.4,16.5,12.1,8,null,11,"BN","Benevento",135,"2",4.4000000000000004,"W",null,11,"BN","Benevento",135,"41","07","14","46",-2,null,11,"BN","Benevento",2.9,"2,8","4,0","4,7","5,5","7,4","6,9","10,3","7,8","13,1","7,8","16,8","6,8","19,6","6,3","16,6","5,7","10,7","4,3","6,8","3,2","3,4","2,6","2,3",11,"BENEVENTO","C",137,1316,11,"BENEVENTO","BN",48.8,null,null,11,"BN","Benevento","32,2"]
[12,"BG","Bergamo",249,3.1,4.9000000000000004,8.9,13.3,17,21.3,23.7,23.2,19.899999999999999,14.2,8.6,4.5,null,12,"BG","Bergamo",249,"1",1.9,"NE",null,12,"BG","Bergamo",249,"45","41","9","40",-5,null,12,"BG","Bergamo",2.2999999999999998,"1,9","3,4","3,5","5,0","6,3","6,7","8,9","7,9","11,2","8,4","12,2","7,8","14,6","6,9","11,9","5,5","8,5","3,9","5,2","2,6","2,1","2,1","1,8",12,"BERGAMO","E",183,2533,12,"BERGAMO","BG",38.700000000000003,null,null,12,"BG","Bergamo","31,0"]
[13,"BO","Bologna",54,2.1,4.5999999999999996,9.4,14.2,18.2,22.9,25.4,24.9,21.2,14.9,8.6999999999999993,4,null,13,"BO","Bologna",54,"1",1.6,"SW",null,13,"BO","Bologna",54,"44","29","11","20",-5,null,13,"BO","Bologna",2.5,"2,0","3,6","4,3","5,1","7,0","6,6","10,7","7,7","13,3","8,0","15,6","7,1","18,5","6,6","14,4","5,4","10,0","4,0","5,9","2,7","2,6","2,2","1,9",13,"BOLOGNA","E",183,2259,13,"BOLOGNA","BO",37,null,null,13,"BO","Bologna","33,0"]
[14,"BZ","Bolzano",262,1.2,4.2,9,13.4,16.899999999999999,21,22.7,22,18.8,12.9,6.7,2.2000000000000002,null,14,"BZ","Bolzano",262,"1",0.9,"S",null,14,"BZ","Bolzano",262,"46","29","11","21",-15,null,14,"BZ","Bolzano",2.2999999999999998,"2,2","3,3","4,9","4,9","7,8","6,6","9,9","7,8","12,5","8,4","12,9","7,8","14,7","6,9","11,6","5,4","8,8","3,8","5,5","2,5","2,6","2,0","1,9",14,"BOLZANO","E",183,2791,14,"BOLZANO","BZ",38.9,null,null,14,"BZ","Bolzano","31,4"]
[15,"BS","Brescia",149,1.5,4.2,9.3000000000000007,13.5,17.7,22,24.4,23.7,19.899999999999999,14,7.8,3.5,null,15,"BS","Brescia",149,"1",1.5,"E",null,15,"BS","Brescia",149,"45","32","10","12",-7,null,15,"BS","Brescia",2.4,"2,2","3,5","4,3","5,0","7,4","6,7","9,4","7,8","12,6","8,2","14,3","7,4","17,0","6,7","13,5","5,4","9,3","3,9","5,3","2,6","2,7","2,1","2,2",15,"BRESCIA","E",183,2410,15,"BRESCIA","BS",38.700000000000003,null,null,15,"BS","Brescia","31,8"]
[16,"BR","Brindisi",15,9.3000000000000007,9.6,11.4,14.2,18,22,24.5,24.5,22.1,18.3,14.4,10.9,null,16,"BR","Brindisi",15,"2",5.0999999999999996,"NW",null,16,"BR","Brindisi",15,"40","38","17","56",0,null,16,"BR","Brindisi","3,0","4,0","4,0","5,3","5,4","8,7","6,6","13,0","7,4","16,1","7,1","19,9","6,4","21,0","6,0","17,9","5,3","13,1","4,1","8,9","3,2","4,7","2,7","3,2",16,"BRINDISI","C",137,1083,16,"BRINDISI","BR",41.7,null,null,16,"BR","Brindisi","31,5"]
[17,"CA","Cagliari",4,10.3,10.8,12.8,15.1,18.399999999999999,22.9,25.5,25.5,23.3,19.399999999999999,15.5,11.7,null,17,"CA","Cagliari",4,"3","4,0","NW",null,17,"CA","Cagliari",4,"39","13","9","07",3,null,17,"CA","Cagliari",3.2,"4,1","4,2","5,6","5,5","8,9","6,9","11,6","7,6","14,9","7,7","17,3","6,5","20,8","6,2","17,7","5,7","11,9","4,5","7,7","3,4","4,7","2,9","3,5",17,"CAGLIARI","C",137,990,17,"CAGLIARI","CA",59.5,null,null,17,"CA","Cagliari","32,1"]
[18,"CL","Caltanissetta",568,7.2,7.8,9.9,13.1,17.3,22.5,25.7,25.2,22.1,17.3,12.8,8.9,null,18,"CL","Caltanissetta",568,"3","2,4","W",null,18,"CL","Caltanissetta",568,"37","29","14","03",0,null,18,"CL","Caltanissetta",3.3,"5,7","4,2","7,7","5,5","10,5","6,6","14,2","6,9","18,6","6,6","21,6","6,1","22,1","5,6","19,8","5,4","14,1","4,5","9,3","3,4","6,6","3,0","5,0",18,"CALTANISSETTA","D",166,1550,18,"CALTANISSETTA","CL",59.8,null,null,18,"CL","Caltanissetta","34,0"]
[19,"CB","Campobasso",701,3.7,4.8,7.3,11.1,14.8,19.600000000000001,22.5,22.2,18.899999999999999,13.5,9,5,null,19,"CB","Campobasso",701,"2",4.3,"W",null,19,"CB","Campobasso",701,"41","33","14","40",-4,null,19,"CB","Campobasso",2.9,"3,3","3,9","5,6","5,4","8,1","6,7","12,0","7,4","16,1","7,6","17,7","6,9","19,6","6,2","16,9","5,4","12,0","4,2","7,8","3,1","4,2","2,6","3,0",19,"CAMPOBASSO","E",183,2346,19,"CAMPOBASSO","CB",48.8,null,null,19,"CB","Campobasso","29,6"]
[20,"CE","Caserta",68,8.6999999999999993,9.4,12,15.3,19.100000000000001,23.5,26.2,26.1,23,18.2,13.9,10.3,null,20,"CE","Caserta",68,"2",1.6,"S",null,20,"CE","Caserta",68,"41","04","14","19",0,null,20,"CE","Caserta",2.9,"3,9","3,9","5,8","5,3","9,2","6,6","12,8","7,3","16,5","7,0","20,1","6,2","21,6","5,9","18,3","5,2","13,1","4,0","8,9","3,1","4,7","2,6","3,3",20,"CASERTA","C",137,1013,20,"CASERTA","CE",48.8,null,null,20,"CE","Caserta","32,1"]
[21,"CT","Catania",7,10.7,11.2,12.9,15.5,19.100000000000001,23.5,26.5,26.5,24.1,19.899999999999999,15.9,12.3,null,21,"CT","Catania",7,"3","4,4","W",null,21,"CT","Catania",7,"37",30,"15","05",5,null,21,"CT","Catania",3.3,"5,7","4,2","7,7","5,5","10,5","6,6","14,1","6,9","18,6","6,6","21,6","6,1","22,1","5,6","19,8","5,4","14,1","4,5","9,2","3,4","6,6","3,0","5,0",21,"CATANIA","B",121,833,21,"CATANIA","CT",59.8,null,null,21,"CT","Catania","33,6"]
[22,"CZ","Catanzaro",320,8.3000000000000007,8.6999999999999993,10.4,13.4,17,21.7,24.4,24.8,22.3,17.899999999999999,13.7,10.1,null,22,"CZ","Catanzaro",320,"2","3,2","W",null,22,"CZ","Catanzaro",320,"38","54","16","35",-2,null,22,"CZ","Catanzaro",3.2,"4,1","4,1","7,1","5,7","7,1","6,9","12,0","7,5","15,6","7,1","19,8","6,5","20,9","5,6","19,6","5,9","10,9","4,5","8,0","3,5","4,4","2,9","3,6",22,"CATANZARO","C",137,1328,22,"CATANZARO","CZ",59.8,null,null,22,"CZ","Catanzaro","33,0"]
[23,"CH","Chieti",330,5.8,6.8,9.6,13.5,17.2,22,24.7,24.3,21.2,15.9,11.3,7.2,null,23,"CH","Chieti",330,"2","2,0","SW",null,23,"CH","Chieti",330,"42","21","14","10",0,null,23,"CH","Chieti",2.8,"3,1","3,9","4,9","5,3","7,8","6,6","12,1","7,3","16,0","7,8","17,0","6,8","19,6","6,4","16,1","5,3","11,8","4,0","7,8","3,0","3,8","2,5","2,6",23,"CHIETI","D",166,1556,23,"CHIETI","CH",39.799999999999997,null,null,23,"CH","Chieti","29,4"]
[24,"CO","Como",201,2.9,5,8.8000000000000007,12.7,16.7,21.1,23.6,23.1,19.600000000000001,13.7,8.4,4.4000000000000004,null,24,"CO","Como",201,"1","0,9","S",null,24,"CO","Como",201,"45","48","9","05",-5,null,24,"CO","Como",2.4,"2,2","3,4","3,4","5,0","6,1","6,7","8,9","7,9","10,2","8,4","12,1","7,9","14,2","7,0","11,0","5,6","7,5","3,9","5,1","2,6","2,3","2,1","1,9",24,"COMO","E",183,2228,24,"COMO","CO",38.700000000000003,null,null,24,"CO","Como","32,0"]
[25,"CS","Cosenza",238,8.1,8.8000000000000007,11.3,14.4,18.100000000000001,23.1,26,25.8,22.7,17.8,13.4,9.4,null,25,"CS","Cosenza",238,"2","2,4","W",null,25,"CS","Cosenza",238,"39",18,"16","15",-3,null,25,"CS","Cosenza",3.2,"4,5","3,9","7,9","4,9","12,4","6,2","15,6","6,8","18,9","6,0","23,6","5,8","23,1","5,2","20,8","4,9","15,1","4,3","8,6","3,2","6,2","2,8","4,9",25,"COSENZA","C",137,1317,25,"COSENZA","CS",59.8,null,null,25,"CS","Cosenza","33,6"]
[26,"CR","Cremona",45,0.7,3.3,8.4,13.3,17.399999999999999,21.9,24.3,23.4,19.7,13.4,7.2,2.5,null,26,"CR","Cremona",45,"1","1,4","E",null,26,"CR","Cremona",45,"45","08","10","01",-5,null,26,"CR","Cremona",2.2999999999999998,"1,6","3,5","3,3","5,1","6,4","6,7","10,1","7,8","12,7","8,0","15,8","7,2","17,8","6,7","13,5","5,5","8,8","4,0","4,4","2,6","1,9","2,0","1,3",26,"CREMONA","E",183,2389,26,"CREMONA","CR",38.700000000000003,null,null,26,"CR","Cremona","33,0"]
[27,"KR","Crotone","8",9.5,9.8000000000000007,11.5,14.7,18.399999999999999,22.9,26.2,26,23.5,19.3,15.1,11.2,null,27,"KR","Crotone","8","3","3,5","N",null,27,"KR","Crotone","8","39","04","17","07",3,null,27,"KR","Crotone","3,2","4,2","4,2","6,5","5,5","9,0","6,8","12,5","7,4","16,1","7,4","18,7","6,8","19,8","6,0","18,3","5,6","12,3","4,4","8,6","3,4","5,2","2,9","3,5",27,"CROTONE","B",121,899,27,"CROTONE","KR",59.8,null,null,27,"KR","Crotone","34,5"]
[28,"CN","Cuneo",534,1.1000000000000001,2.9,6.9,11.3,14.8,19.399999999999999,21.9,21,17.7,11.7,6.2,2.5,null,28,"CN","Cuneo",534,"2","1,6","NE",null,28,"CN","Cuneo",534,"44","22","7","32",-10,null,28,"CN","Cuneo",2.5,"3,0","3,6","4,5","5,2","6,3","6,8","7,8","8,0","8,4","8,5","10,1","8,1","12,2","7,2","8,8","5,7","6,7","4,1","4,6","2,8","3,1","2,2","2,8",28,"CUNEO","F",217,3012,28,"CUNEO","CN",44.4,null,null,28,"CN","Cuneo","29,0"]
[29,"EN","Enna",931,4.5,5.0999999999999996,7.1,10.7,14.9,20.6,23.9,23.2,19.899999999999999,14.5,9.8000000000000007,6.4,null,29,"EN","Enna",931,"3","3,8","W",null,29,"EN","Enna",931,"37","33","14","16",-3,null,29,"EN","Enna",3.3,"5,6","4,2","7,7","5,5","10,6","6,5","14,6","6,8","18,9","6,5","22,1","6,0","22,6","5,4","20,5","5,3","14,5","4,5","9,4","3,4","6,7","3,0","4,9",29,"ENNA","E",183,2248,29,"ENNA","EN",59.8,null,null,29,"EN","Enna","29,2"]
[30,"FE","Ferrara",9,1.4,3.3,7.8,12.8,17.3,21.6,23.9,23.5,20.100000000000001,14,8.1999999999999993,3.2,null,30,"FE","Ferrara",9,"1","2,4","W",null,30,"FE","Ferrara",9,"44","50","11","37",-5,null,30,"FE","Ferrara",2.5,"2,1","3,6","4,1","5,2","5,7","6,7","10,7","7,7","13,4","8,2","14,2","7,5","16,4","7,0","12,2","5,4","10,2","3,9","6,8","2,7","2,0","2,1","1,3",30,"FERRARA","E",183,2326,30,"FERRARA","FE",37,null,null,30,"FE","Ferrara","32,2"]
[31,"FI","Firenze",40,5.3,6.5,9.9,13.8,17.8,22.2,25,24.3,20.9,15.3,10.199999999999999,6.3,null,31,"FI","Firenze",40,"2","1,4","NE",null,31,"FI","Firenze",40,"43","41","11","15",0,null,31,"FI","Firenze",2.6,"2,7","3,7","4,5","5,2","7,0","6,7","10,7","7,6","14,3","7,9","16,2","7,0","18,6","6,5","15,2","5,3","11,0","4,0","6,9","2,9","3,2","2,3","2,3",31,"FIRENZE","D",166,1821,31,"FIRENZE","FI",28.3,null,null,31,"FI","Firenze","33,6"]
[32,"FG","Foggia",76,6.4,7.3,10,13.8,17.899999999999999,23.2,26,25.5,22.1,16.899999999999999,12.2,7.9,null,32,"FG","Foggia",76,"1","3,5","NW",null,32,"FG","Foggia",76,"41","27","15","33",0,null,32,"FG","Foggia","2,9","3,5","3,9","5,8","5,3","8,6","6,5","13,0","7,3","16,5","7,5","18,2","6,8","19,8","6,2","17,0","5,3","12,5","4,1","8,4","3,1","4,6","2,6","3,1",32,"FOGGIA","D",166,1530,32,"FOGGIA","FG",41.7,null,null,32,"FG","Foggia","33,9"]
[33,"FO","Forlì",34,3,4.5999999999999996,9,13.7,17.8,22.6,25.3,24.8,21.1,15.1,9.3000000000000007,4.4000000000000004,null,33,"FO","Forlì",34,"1","2,3","NW",null,33,"FO","Forlì",34,"44","13","12","02",-5,null,33,"FO","Forlì",2.5,"2,3","3,6","4,3","5,1","7,5","6,6","11,1","7,5","14,7","7,7","17,6","6,7","19,9","6,3","15,9","5,2","11,4","4,0","6,3","2,8","2,7","2,2","1,9",33,"FORLì","D",166,2087,33,"FORLI'","FO",37,null,null,33,"FO","Forlì","32,0"]
[34,"FR","Frosinone",291,5.8,6.2,8,11,15.2,18.5,21.5,20.9,18.8,13.4,9.1999999999999993,5,null,34,"FR","Frosinone",291,"2","1,7","S",null,34,"FR","Frosinone",291,"41","38","13","20",0,null,34,"FR","Frosinone",2.9,"3,6","3,9","5,3","5,3","8,5","6,7","10,7","7,7","13,2","7,6","17,0","6,9","19,0","6,4","15,9","5,4","11,8","4,2","7,4","3,1","4,3","2,5","3,1",34,"FROSINONE","E",183,2196,34,"FROSINONE","FR",39.799999999999997,null,null,34,"FR","Frosinone","30,7"]
[35,"GE","Genova",19,7.9,8.9,11.6,14.7,17.8,21.9,24.5,24.6,22.3,17.100000000000001,12.9,9.3000000000000007,null,35,"GE","Genova",19,"3","3,8","NE",null,35,"GE","Genova",19,"44","25","8","53",0,null,35,"GE","Genova",2.5,2.8,"3,6","4,6","5,1","7,4","6,7","10,2","7,8","12,8","8,2","14,5","7,4","17,4","6,8","13,7","5,5","9,9","4,0","6,6","2,8","3,0","2,2","2,7",35,"GENOVA","D",166,1435,35,"GENOVA","GE",63.2,null,null,35,"GE","Genova","29,9"]
[36,"GO","Gorizia",84,4.7,5.6,8.1999999999999993,11.9,16.7,19.899999999999999,22,22.2,18.600000000000001,13.2,9.1999999999999993,4.7,null,36,"GO","Gorizia",84,"2","1,5","E",null,36,"GO","Gorizia",84,"45","56","13","37",-5,null,36,"GO","Gorizia","2,4","2,2","3,4","3,7","5,0","6,4","6,7","9,5","7,9","11,7","8,3","13,1",7.7,"15,3","6,7","13,4","5,5","9,1","3,9","5,4","2,6","2,7","2,0","1,9",36,"GORIZIA","E",183,2333,36,"GORIZIA","GO",57.5,null,null,36,"GO","Gorizia","30,5"]
[37,"GR","Grosseto",10,6.8,8.1,10.3,13.2,17.100000000000001,21.2,24.1,23.9,21.3,16.399999999999999,11.7,8.1,null,37,"GR","Grosseto",10,"3","2,4","NE",null,37,"GR","Grosseto",10,"42","45","11","06",0,null,37,"GR","Grosseto","2,8","3,2","3,8","4,9","5,3","7,5","6,7","11,5","7,4","15,9","7,6","17,9",6.6,"20,5","6,1","17,2","5,4","11,6","4,0","7,7","3,0","3,7","2,4","2,6",37,"GROSSETO","D",166,1550,37,"GROSSETO","GR",28.3,null,null,37,"GR","Grosseto","33,0"]
[38,"IM","Imperia",10,8.6,9.4,11.6,14.7,17.899999999999999,21.7,24.5,24.1,21.8,17.399999999999999,12.7,9.5,null,38,"IM","Imperia",10,3,"3,7","NE",null,38,"IM","Imperia",10,43,53,8,1,0,null,38,"IM","Imperia","2,6","3,4","3,6","5,4","5,1","8,2","6,5","12,0","7,6","14,5","7,8","16,9",6.8,"19,6","6,5","15,2","5,3","11,2","3,9","7,7","2,8","4,1","2,3","3,3",38,"IMPERIA","C",137,1201,38,"IMPERIA","IM",63.2,null,null,38,"IM","Imperia","29,0"]
[39,"IS","Isernia",423,5.5,5.7,8.6,11.2,15.5,20.100000000000001,23.1,22.8,19.7,14.7,10.3,6.9,null,39,"IS","Isernia",423,"2","4,0","NW",null,39,"IS","Isernia",423,"41","35","14","13",-2,null,39,"IS","Isernia","2,9","3,1","3,9","4,8","5,4","7,5","6,9","9,5","7,9","11,8","8,0","15,3","7,2","18,0","6,6","15,1","5,6","10,6","4,3","6,5","3,1","3,7","2,5","2,7",39,"ISERNIA","D",166,1866,39,"ISERNIA","IS",48.8,null,null,39,"IS","Isernia","29,9"]
[40,"SP","La Spezia",3,6.7,7.3,10.1,13.4,16.7,20.9,23.8,23.7,21.2,16.399999999999999,11.9,8.3000000000000007,null,40,"SP","La Spezia",3,"3","5,5","N",null,40,"SP","La Spezia",3,"44","06","9","49",0,null,40,"SP","La Spezia","2,6","2,7","3,6","4,9","5,1","7,8","6,7","10,4","7,8","12,4","8,0","15,5","7,0","18,8","6,6","14,7","5,4","10,5","4,0","6,3","2,8","3,0","2,3","2,5",40,"LA SPEZIA","D",166,1413,40,"LA SPEZIA","SP",63.2,null,null,40,"SP","La Spezia","30,2"]
[41,"AQ","L'Aquila",714,2,3.6,7.1,11.4,15,19.100000000000001,22,21.8,18.600000000000001,13.1,8.1999999999999993,3.8,null,41,"AQ","L'Aquila",714,"2",1.7,"SE",null,41,"AQ","L'Aquila",714,"42","21","13","23",-5,null,41,"AQ","L'Aquila",2.8,"3,2","3,8","4,6","5,3","6,7","6,9","7,9","8,0","11,3","8,4","12,7","7,7","15,9","7,0","13,1","5,7","10,0","4,2","6,4","3,0","3,4","2,5","2,6",41,"L'AQUILA","E",183,2514,41,"L'AQUILA","AQ",39.799999999999997,null,null,41,"AQ","L'Aquila","29,1"]
[42,"LT","Latina","21",8.3000000000000007,9,10.9,13.5,16.899999999999999,20.9,23.7,23.8,21.5,17.3,12.9,9.5,null,42,"LT","Latina","21","3","2,4","W",null,42,"LT","Latina","21","41","27","12","54",2,null,42,"LT","Latina","2,9","3,8","3,9","5,7","5,2","9,2","6,6","12,9","7,2","16,6","7,0","20,0","6,2","21,7","5,9","18,1","5,2","13,1","4,0","8,7","3,1","4,7","2,6","3,3",42,"LATINA","C",137,1220,42,"LATINA","LT",39.799999999999997,null,null,42,"LT","Latina","33,2"]
[43,"LE","Lecce","49",9,9.3000000000000007,11.4,14.7,18.899999999999999,23.4,26.1,25.9,23,18.5,14.3,10.7,null,43,"LE","Lecce","49","2","4,0","N",null,43,"LE","Lecce","49","40","21","18","10",0,null,43,"LE","Lecce","3,0","3,8","4,0","5,8","5,5","8,1","6,8","12,1","7,3","16,3","7,4","18,7","6,5","20,7","6,0","18,0","5,4","12,5","4,2","8,1","3,3","4,1","2,7","3,2",43,"LECCE","C",137,1153,43,"LECCE","LE",41.7,null,null,43,"LE","Lecce","33,0"]
[44,"LC","Lecco","214",3.9,5.7,9.6,13.3,16,20.100000000000001,22.6,22.1,19.2,14.3,9.1999999999999993,5.3,null,44,"LC","Lecco","214","1","0,9","S",null,44,"LC","Lecco","214","45","51","9","24",-5,null,44,"LC","Lecco","2,4","2,3","3,4","3,6","5,0","6,4","6,7","9,1","7,9","10,5","8,4","12,3","7,9","14,2","7,0","11,2","5,6","7,8","3,9","5,2","2,6","2,5","2,1","2,0",44,"LECCO","E",183,2383,44,"LECCO","LC",38.700000000000003,null,null,44,"LC","Lecco","31,9"]
[45,"LI","Livorno","3",7.5,8.1999999999999993,11.1,13.9,17.3,21.8,24.4,24.1,21.5,17.100000000000001,12.7,9,null,45,"LI","Livorno","3","3","2,4","E",null,45,"LI","Livorno","3","43","33","10","19",0,null,45,"LI","Livorno","2,6","2,8","3,7","4,6","5,2","7,2","6,7","11,2","7,5","15,0","7,9","16,7","6,9","19,3","6,4","15,9","5,3","11,3","4,0","7,3","2,9","3,3","2,3","2,4",45,"LIVORNO","D",166,1408,45,"LIVORNO","LI",28.3,null,null,45,"LI","Livorno","31,0"]
[46,"LD","Lodi","87",0.9,3.3,8.6,13.5,17.8,22.5,24.5,23.4,19.600000000000001,13.4,7.3,2.5,null,46,"LD","Lodi","87","1","1,1","SW",null,46,"LD","Lodi","87","45","18","9","30",-5,null,46,"LD","Lodi","2,3","1,4","3,5","3,1","5,1","6,2","6,7","9,7","7,8","12,2","8,1","14,9","7,4","17,1","6,8","12,8","5,6","8,2","4,0","4,2","2,6","1,8","2,0","1,2",46,"LODI","E",183,2592,46,"LODI","LD",38.700000000000003,null,null,46,"LD","Lodi","32,4"]
[47,"LU","Lucca","19",6.1,7.2,10.1,13.3,17.100000000000001,21.2,23.8,23.6,20.9,15.8,10.9,7.3,null,47,"LU","Lucca","19","2","1,5","E",null,47,"LU","Lucca","19","43","50","10","03",0,null,47,"LU","Lucca","2,6","2,7","3,7","4,2","5,2","7,1","6,8","9,9","7,9","12,4","8,2","14,5","7,3","17,4","6,7","13,8","5,5","10,3","4,0","6,7","2,8","3,0","2,3","2,1",47,"LUCCA","D",166,1715,47,"LUCCA","LU",28.3,null,null,47,"LU","Lucca","32,5"]
[48,"MC","Macerata","315",3.8,5.3,8.3000000000000007,12.4,16.3,20.7,23.5,23.2,19.899999999999999,14.4,9.5,5.7,null,48,"MC","Macerata","315","2","3,4","NW",null,48,"MC","Macerata","315","43","17","13","27",-2,null,48,"MC","Macerata","2,7","2,8","3,7","4,7","5,3","7,2","6,7","10,9","7,5","15,2","7,8","16,7","7,1","18,3","6,5","15,2","5,4","11,1","4,0","7,0","2,9","3,5","2,4","2,4",48,"MACERATA","D",166,2005,48,"MACERATA","MC",28.3,null,null,48,"MC","Macerata","31,2"]
[49,"MN","Mantova","19",1,3.3,8.4,13.3,17.399999999999999,22,24.3,23.6,20,14,8,2.9,null,49,"MN","Mantova","19","1","0,9","E",null,49,"MN","Mantova","19","45","09","10","46",-5,null,49,"MN","Mantova","2,3","1,5","3,5","3,1","5,1","6,0","6,7","9,5","7,8","12,2","8,0","15,5","7,3","17,4","6,8","13,0","5,6","8,2","4,0","4,1","2,6","1,8","2,0","1,3",49,"MANTOVA","E",183,2388,49,"MANTOVA","MN",38.700000000000003,null,null,49,"MN","Mantova","33,0"]
[50,"MS","Massa-Carrara","65",6.8,7.4,10.3,13.2,16.899999999999999,21.2,23.7,23.3,20.6,15.9,11.3,7.9,null,50,"MS","Massa-Carrara","65","2","3,5","N",null,50,"MS","Massa-Carrara","65","44","01","10","07",0,null,50,"MS","Massa-Carrara","2,6","2,7","3,6","4,7","5,1","7,5","6,7","10,2","7,8","12,4","8,1","15,1","7,1","18,3","6,6","14,4","5,4","10,4","4,0","6,4","2,8","3,0","2,3","2,4",50,"MASSA-Carrara","D",166,1525,50,"MASSA","MS",63.2,null,null,50,"MS","Massa-Carrara","32,5"]
[51,"MT","Matera","200",7.7,8.4,10.5,14.2,18.5,23.6,26.7,26.2,22.9,18,13.3,9.3000000000000007,null,51,"MT","Matera","200","1","2,9","N",null,51,"MT","Matera","200","40","39","16","36",-2,null,51,"MT","Matera","3,0","3,3","4,0","5,7","5,5","7,6","6,8","11,6","7,6","15,1","7,7","17,4","6,8","19,7","6,2","17,0","5,4","12,3","4,4","7,2","3,2","3,8","2,7","3,1",51,"MATERA","D",166,1776,51,"MATERA","MT",41.7,null,null,51,"MT","Matera","34,1"]
[52,"ME","Messina","3",11.7,12,13.2,15.7,19.2,23.5,26.4,26.5,24.2,20.3,16.600000000000001,13.3,null,52,"ME","Messina","3","3","2,8","N",null,52,"ME","Messina","3","38","11","15","32",5,null,52,"ME","Messina","3,3","3,9","4,3","6,5","5,6","9,6","6,7","13,6","7,2","17,2","7,0","20,3","6,6","20,6","6,0","18,6","5,4","13,6","4,6","8,3","3,5","5,4","3,0",3.6,52,"MESSINA","B",121,707,52,"MESSINA","ME",59.8,null,null,52,"ME","Messina","32,3"]
[53,"MI","Milano","122",1.7,4.2,9.1999999999999993,14,17.899999999999999,22.5,25.1,24.1,20.399999999999999,14,7.9,3.1,null,53,"MI","Milano","122","1","1,1","SW",null,53,"MI","Milano","122","45","27","9","11",-5,null,53,"MI","Milano","2,3","1,5","3,5","3,2","5,1","6,5","6,7","9,8","7,9","12,1","8,3","13,9","7,5","16,5","6,9","12,5","5,6","8,4","3,9","4,5","2,5","1,9","2,0","1,3",53,"MILANO","E",183,2404,53,"MILANO","MI",38.700000000000003,null,null,53,"MI","Milano","31,9"]
[54,"MO","Modena","34",1.4,3.5,8.6,13.3,17.2,21.8,24.3,23.8,20.100000000000001,14,8.1,3.1,null,54,"MO","Modena","34","1","1,6","SW",null,54,"MO","Modena","34","44","38","10","55",-5,null,54,"MO","Modena","2,5","1,9","3,6","3,4","5,1","6,7","6,7","10,5","7,6","14,0","7,9","16,1","7,2","17,8","6,8","13,5","5,5","9,6","4,0","6,0","2,7","2,6","2,2","1,9",54,"MODENA","E",183,2258,54,"MODENA","MO",37,null,null,54,"MO","Modena","32,2"]
[55,"NA","Napoli","17",10.5,10.6,13.2,16,19.5,24.1,26.7,26.5,23.8,19.600000000000001,15.5,12.1,null,55,"NA","Napoli","17","3","2,3","NE",null,55,"NA","Napoli","17","40","51","14","15",2,null,55,"NA","Napoli","3,0","3,7","4,0","5,6","5,4","8,5","6,7","12,2","7,4","16,3","7,4","18,9","6,6","20,6","6,0","17,9","5,4","12,4","4,1","8,7","3,2","4,4","2,7","3,1",55,"NAPOLI","C",137,1034,55,"NAPOLI","NA",48.8,null,null,55,"NA","Napoli","32,4"]
[56,"NO","Novara","159",0.9,3.3,8.4,13.1,17.399999999999999,21.8,24.3,23.3,19.2,12.9,7.1,2.4,null,56,"NO","Novara","159","1","0,8","N",null,56,"NO","Novara","159","45","25","8","37",-5,null,56,"NO","Novara","2,3","1,7","3,5","3,7","5,0","6,8","6,6","10,2","7,8","12,2","8,2","14,2","7,4","16,9","6,8","12,8","5,5","8,7","3,9","4,3","2,6","2,2","2,0","1,4",56,"NOVARA","E",183,2463,56,"NOVARA","NO",44.4,null,null,56,"NO","Novara","30,7"]
[57,"NU","Nuoro","546",6.2,6.7,9.5,12.4,15.7,21.1,24.3,24.1,20.9,15.7,11.2,7.6,null,57,"NU","Nuoro","546","3","2,4","NW",null,57,"NU","Nuoro","546","40","19","9","19",0,null,57,"NU","Nuoro","3,1","3,8","4,1","5,5","5,4","8,8","6,8","12,1","7,3","16,3","7,3","18,9","6,2","21,8","6,1","17,8","5,4","12,7","4,3","8,0","3,3","4,4","2,8","3,2",57,"NUORO","D",166,1602,57,"NUORO","NU",59.5,null,null,57,"NU","Nuoro","31,0"]
[58,"OR","Oristano","9",9.6,10.199999999999999,12.3,14.5,17.399999999999999,21.4,23.5,24.1,22.6,18.7,14.4,10.8,null,58,"OR","Oristano","9","4","4,3","NW",null,58,"OR","Oristano","9","39","54","8","35",3,null,58,"OR","Oristano","3,1","3,9","4,1","5,8","5,4","8,9","6,8","12,0","7,4","15,9","7,5","18,2","6,3","21,3","6,1","17,9","5,4","12,8","4,3","8,3",3.3,"4,5","2,8","3,3",58,"ORISTANO","C",137,1059,58,"ORISTANO","OR",59.5,null,null,58,"OR","Oristano","32,9"]
[59,"PD","Padova","12",1.9,4,8.4,13,17.100000000000001,21.3,23.6,23.1,19.7,13.8,8.1999999999999993,3.6,null,59,"PD","Padova","12","1","1,0","NE",null,59,"PD","Padova","12","45","24","11","52",-5,null,59,"PD","Padova","2,3","1,8","3,5","3,6","5,1","5,9","6,7","8,0","7,9","10,9","8,4","12,2","8,0","13,5","7,0","11,7","5,5","8,9","3,9","5,5","2,6","2,4","2,1","2,1",59,"PADOVA","E",183,2383,59,"PADOVA","PD",38.9,null,null,59,"PD","Padova","32,5"]
[60,"PA","Palermo","14",11.1,11.6,13.1,15.5,18.8,22.7,25.5,25.4,23.6,19.8,16,12.6,null,60,"PA","Palermo","14","3","3,6","SW",null,60,"PA","Palermo","14","38","07","13","21",5,null,60,"PA","Palermo","3,3","4,4","4,3","6,8","5,5","10,2","6,6","14,2","6,9","18,3","6,8","21,1","6,3","21,6","5,6","19,6","5,2","14,4","4,4","9,1","3,5","5,8","3,0","3,9",60,"PALERMO","B",121,751,60,"PALERMO","PA",59.8,null,null,60,"PA","Palermo","32,6"]
[61,"PR","Parma","57",0.9,3.5,8.9,13.7,17.600000000000001,22.2,24.7,24,20.2,14.1,8,2.8,null,61,"PR","Parma","57","1","1,1","E",null,61,"PR","Parma","57","44","48","10","19",-5,null,61,"PR","Parma","2,4","1,9","3,6","4,1","5,0","8,0","6,5","11,8","7,6","13,9","7,8","17,0","6,8","19,5","6,4","15,4","5,1","11,8","4,0","6,0","2,7","2,5","2,1","1,6",61,"PARMA","E",183,2502,61,"PARMA","PR",37,null,null,61,"PR","Parma","31,0"]
[62,"PV","Pavia","77",0.5,3.2,8.4,12.9,17.100000000000001,21.3,23.5,22.7,19.3,13.3,7.1,2.2999999999999998,null,62,"PV","Pavia","77","1","1,2","S",null,62,"PV","Pavia","77","45","11","9","09",-5,null,62,"PV","Pavia","2,3","1,4","3,5","3,0","5,1","6,0","6,7","9,6","7,8","12,3","8,0","15,7","7,3","17,5","6,8","13,1","5,6","8,1","4,0","4,0","2,6","1,7","2,0","1,2",62,"PAVIA","E",183,2623,62,"PAVIA","PV",38.700000000000003,null,null,62,"PV","Pavia","32,0"]
[63,"PG","Perugia","493",4,5,8.1,11.5,15.4,20.100000000000001,23.1,22.7,19.600000000000001,14.1,9.4,5.5,null,63,"PG","Perugia","493","2","1,4","NE",null,63,"PG","Perugia","493","43","06","12","23",-2,null,63,"PG","Perugia","2,7","2,8","3,8","4,1","5,3","7,0","6,8","9,8","7,7","13,7","8,0","15,6","7,1","18,4","6,6","14,9","5,5","10,6","4,0","7,4","2,9","3,4","2,4","2,2",63,"PERUGIA","E",183,2289,63,"PERUGIA","PG",28.3,null,null,63,"PG","Perugia","28,6"]
[64,"PS","Pesaro e Urbino","11",3.6,4.7,8.4,12.3,16.2,20.6,23.2,22.7,19.7,14.7,9.9,5.4,null,64,"PS","Pesaro e Urbino","11","2","3,4","S",null,64,"PS","Pesaro e Urbino","11","43","54","12","54",-2,null,64,"PS","Pesaro e Urbino","2,4","1,6","3,6","3,4","5,2","6,9","6,7","10,7","7,7","13,5","8,1","14,9","7,1","18,3","6,4","15,4","5,5","10,1","4,1","5,6","2,8","2,6","2,2","1,7",64,"PESARO e URBINO","D",166,2083,64,"PESARO URBINO","PS",28.3,null,null,64,"PS","Pesaro e Urbino","30,5"]
[65,"PE","Pescara","4",7.2,8.4,10.9,14.2,18.5,22.7,25.4,25,22,17.399999999999999,12.5,8.6999999999999993,null,65,"PE","Pescara","4","2","2,0","SW",null,65,"PE","Pescara","4","42","27","14","12",2,null,65,"PE","Pescara","2,8","2,9","3,9","4,7","5,3","7,5","6,6","11,9","7,4","15,6","7,9","16,5","6,9","19,2","6,5","15,7","5,4","11,4","4,1","7,4","3,0","3,7","2,5","2,4",65,"PESCARA","D",166,1718,65,"PESCARA","PE",39.799999999999997,null,null,65,"PE","Pescara","31,6"]
[66,"PC","Piacenza","61",0.1,2.4,7.7,12.2,16.3,20.7,23.2,22.3,18.899999999999999,12.8,6.9,2,null,66,"PC","Piacenza","61","1","1,2","E",null,66,"PC","Piacenza","61","45","03","9","41",-5,null,66,"PC","Piacenza","2,4","2,0","3,5","3,8","5,1","7,1","6,6","10,9","7,7","13,4","8,0","15,9","7,1","18,4","6,6","14,1","5,4","9,9","4,0","5,1",2.6,"2,2","2,1","1,4",66,"PIACENZA","E",183,2715,66,"PIACENZA","PC",38.700000000000003,null,null,66,"PC","Piacenza","32,6"]
[67,"PI","Pisa","4",6.7,7.7,10.6,13.6,17.2,21.1,23.5,23.5,20.9,16.3,11.7,7.8,null,67,"PI","Pisa","4","3","2,4","E",null,67,"PI","Pisa","4","43","42","10","24",0,null,67,"PI","Pisa","2,6","2,7","3,7","4,6","5,2","7,1","6,7","11,1","7,5","14,8","7,9","16,5","6,9","19,1","6,4","15,6","5,3","11,3","4,0","7,2","2,9","3,2","2,3","2,4",67,"PISA","D",166,1694,67,"PISA","PI",28.3,null,null,67,"PI","Pisa","31,5"]
[68,"PT","Pistoia","67",5.3,6.5,9.9,13.4,17.2,21.3,24.1,23.6,20.9,15.3,10.4,6.3,null,68,"PT","Pisoia","67","2","3,7","S",null,68,"PT","Pisoia","67","43","55","10","54",0,null,68,"PT","Pistoia","2,6","2,4","3,7","4,0","5,2","6,1","6,8","8,1","8,0","9,9","8,4","11,6","7,7","15,3","6,9","12,8","5,6","9,2","4,1","5,9","2,8","2,9","2,3","2,1",68,"PISTOIA","D",166,1885,68,"PISTOIA","PT",28.3,null,null,68,"PT","Pisoia","31,6"]
[69,"PN","Pordenone","24",2.2999999999999998,4.4000000000000004,8.1,12.1,15.7,18.399999999999999,21.5,21.2,18.3,12.9,7.4,3.8,null,69,"PN","Pordenone","24","1","1,3","NE",null,69,"PN","Pordenone","24","45","57","12","39",-5,null,69,"PN","Pordenone","2,3","2,2","3,4","4,1","5,0","6,4","6,7","8,3","7,9","11,0","8,3","12,8","7,9","14,1","6,8","12,8","5,4","9,0","3,9","5,5","2,5","2,2","2,0","1,9",69,"PORDENONE","E",183,2459,69,"PORDENONE","PN",57.5,null,null,69,"PN","Pordenone","33,0"]
[70,"PZ","Potenza","819",3.6,4.3,6.8,10.6,14.7,19.100000000000001,21.9,21.9,18.899999999999999,13.7,9.3000000000000007,5.2,null,70,"PZ","Potenza","819","3","3,8","W",null,70,"PZ","Potenza","819","40","38","15","48",-3,null,70,"PZ","Potenza","3,0","3,0","4,1","4,8","5,5","7,5","6,9","10,9","7,7","14,2","7,6","17,7","7,0","19,0","6,5","15,9","5,7","11,1","4,4","7,1","3,2","4,1","2,7","2,8",70,"POTENZA","E",183,2472,70,"POTENZA","PZ",48.8,null,null,70,"PZ","Potenza","28,7"]
[71,"PO","Prato","61",5.6,6.9,10.4,14.3,18,22.3,25,24.7,21.6,16.100000000000001,10.9,6.8,null,71,"PO","Prato","61","2","1,4","NE",null,71,"PO","Prato","61","43","52","11","05",0,null,71,"PO","Prato","2,6","2,5","3,7","4,1","5,2","6,3","6,8","8,8","7,9","11,0","8,3","12,7","7,5","16,2","6,8","13,4","5,5","9,","4,1","6,2","2,8","2,9","2,3","2,1",71,"PRATO","D",166,1668,71,"PRATO","PO",28.3,null,null,71,"PO","Prato","32,5"]
[72,"RG","Ragusa","502",8.6,9.1999999999999993,11.2,14.1,18.5,23.6,26.6,26.4,23.2,18.399999999999999,14.3,10.1,null,72,"RG","Ragusa","502","3","2,1","W",null,72,"RG","Ragusa","502","36","55","14","43",0,null,72,"RG","Ragusa","3,4","5,6","4,4","7,5","5,5","11,6","6,5","15,0","7,0","18,4","7,4","19,1","6,9","19,8","6,0","18,8","5,2","14,8","4,1","11,1","3,3","7,6","3,2","4,4",72,"RAGUSA","C",137,1324,72,"RAGUSA","RG",59.8,null,null,72,"RG","Ragusa","34,1"]
[73,"RA","Ravenna","4",1.9,3.4,8.1,12.4,16.399999999999999,20.9,23.4,22.9,19.7,14.3,8.9,3.8,null,73,"RA","Ravenna","4","2","2,1","E",null,73,"RA","Ravenna","4","44","25","12","11",-5,null,73,"RA","Ravenna","2,5","1,9","3,6","3,5","5,1","7,5","6,6","11,1","7,8","13,1","8,0","15,9","7,2","18,1","6,6","14,4",5.4,"10,1","4,0","5,5","2,7","2,4","2,1","1,5",73,"RAVENNA","E",183,2227,73,"RAVENNA","RA",37,null,null,73,"RA","Ravenna","31,0"]
[74,"RC","Reggio di Calabria","15",11.1,11.5,12.8,15.3,18.7,23,25.7,26.1,23.8,20,16.5,12.7,null,74,"RC","Reggio di Calabria","15","3","2,8","N",null,74,"RC","Reggio di Calabria","15","38","06","15","38",3,null,74,"RC","Reggio di Calabria","3,3","4,2","4,2","7,2","5,7","9,0","6,6","14,0","7,1","17,6","6,8","21,1","6,4","21,1","5,8","19,1","5,4","13,7","4,5","8,3","3,5","5,5","3,0","3,8",74,"REGGIO di CALABRIA","B",121,772,74,"REGGIO CALABRIA","RC",59.8,null,null,74,"RC","Reggio di Clabria","34,0"]
[75,"RE","Reggio nell'Emilia","58",1.1000000000000001,3.2,8.1999999999999993,12.7,16.899999999999999,21.2,23.8,22.9,19.600000000000001,13.3,7.2,2.8,null,75,"RE","Reggio nell'Emilia","58","1","1,1","E",null,75,"RE","Reggio nell'Emilia","58","44","41","10","37",-5,null,75,"RE","Reggio nell'Emilia","2,5","1,9","3,6","3,6","5,1","7,1","6,6","10,9","7,6","14,0","7,9","16,4","7,1","18,3","6,7","14,1","5,4","10,3","4,0","6,0","2,7","2,6","2,2","1,8",75,"REGGIO nell'EMILIA","E",183,2560,75,"REGGIO EMILIA","RE",37,null,null,75,"RE","Reggio nell'Emilia","31,5"]
[76,"RI","Rieti",405,3.7,4.9000000000000004,8.1,11.6,15.2,18.8,21.8,21.7,18.899999999999999,13.5,8.6999999999999993,5.0999999999999996,null,76,"RI","Rieti",405,"2","2,7","W",null,76,"RI","Rieti",405,"42","24","12","52",-3,null,76,"RI","Rieti","2,8","3,2","3,8","4,5","5,3","6,5","6,9","7,6","8,0","11,4","8,4","12,3","7,7","15,6","7,0","12,8","5,7","9,9","4,2","6,4","3,0","3,3","2,5","2,5",76,"RIETI","E",183,2324,76,"RIETI","RI",39.799999999999997,null,null,76,"RI","Rieti","29,5"]
[77,"RN","Rimini",5,3.1,4.9000000000000004,8.5,12.4,16.5,20.8,23.4,22.7,19.899999999999999,15,9.6,5.3,null,77,"RN","Rimini",5,"2","2,3","NW",null,77,"RN","Rimini",5,"44","03","12","34",-5,null,77,"RN","Rimini","2,5","2,1","3,6","4,2","5,1","7,6","6,7","10,2","7,6","14,1","7,9","16,3","7,0","18,7","6,4","15,5","5,3","10,9","4,0","6,3","2,8","2,9","2,2","1,9",77,"RIMINI","E",183,2139,77,"RIMINI","RN",37,null,null,77,"RN","Rimini","30,0"]
[78,"RM","Roma",20,7.6,8.6999999999999993,11.4,14.7,18.5,22.9,25.7,25.3,22.4,17.399999999999999,12.6,8.9,null,78,"RM","Roma",20,"2","2,6","SW",null,78,"RM","Roma",20,"41","53","12","28",0,null,78,"RM","Roma","2,9","3,4","3,9","5,3","5,3","8,4","6,7","12,2","7,3","16,3","7,5","18,2","6,6","20,5","6,2","17,1","5,3","12,3","4,1","8,1","3,1","4,2","2,6","2,8",78,"ROMA","D",166,1415,78,"ROMA","RM",39.799999999999997,null,null,78,"RM","Roma","33,8"]
[79,"RO","Rovigo",7,1.3,3.6,8.5,13.4,17.600000000000001,22,24.5,23.8,20.100000000000001,14,8.1,3.1,null,79,"RO","Rovigo",7,"1","1,9","NE",null,79,"RO","Rovigo",7,"45","04","11","47",-5,null,79,"RO","Rovigo","2,3","1,6","3,5","3,9","5,1","6,9","6,7","9,6","7,6","14,0","7,7","17,3","6,9","19,0","6,3","15,7","5,4","9,7","4,0","5,1","2,6","2,2","2,1","1,8",79,"ROVIGO","E",183,2466,79,"ROVIGO","RO",38.9,null,null,79,"RO","Rovigo","31,5"]
[80,"SA","Salerno",4,10.4,11.3,13.5,16.5,20.100000000000001,23.9,26.5,26.6,24.1,19.899999999999999,15.7,12.2,null,80,"SA","Salerno",4,"3","1,8","SW",null,80,"SA","Salerno",4,"40","40","14","46",2,null,80,"SA","Salerno","3,0","3,0","4,0","4,2","5,5","6,4","7,0","8,7","8,0","11,7","8,2","14,6","7,6","16,2","6,9","13,8","5,9","9,6","4,4","6,7","3,2","3,7","2,7","2,6",80,"SALERNO","C",137,994,80,"SALERNO","SA",48.8,null,null,80,"SA","Salerno","31,2"]
[81,"SS","Sassari",225,8.6999999999999993,9.1,11.3,14,16.8,21.4,24,24.5,22.1,17.5,13.5,9.9,null,81,"SS","Sassari",225,"4","3,1","W",null,81,"SS","Sassari",225,"40","43","8","33",2,null,81,"SS","Sassari","3,0","3,8","4,0","5,8","5,4","8,8","6,7","12,3","7,2","16,9","7,2","19,4","6,1","22,0","6,0","18,0","5,1","13,5","4,1","8,5","3,2","4,3","2,7","3,1",81,"SASSARI","C",137,1185,81,"SASSARI","SS",59.5,null,null,81,"SS","Sassari","30,5"]
[82,"SV","Savona",4,6.6,8.5,11.4,14.6,18.100000000000001,22.2,24.9,24.6,21.9,16.899999999999999,11.9,8.1999999999999993,null,82,"SV","Savona",4,"3","2,2","E",null,82,"SV","Savona",4,"44","18","8","18",0,null,82,"SV","Savona","2,6","2,9","3,6","4,7","5,1","7,4","6,7","9,9","7,9","11,7","8,4","12,8","7,6","16,1","6,9","12,5","5,5","9,6","4,0","6,3","2,8","3,4","2,3","2,7",82,"SAVONA","D",166,1481,82,"SAVONA","SV",63.2,null,null,82,"SV","Savona","29,1"]
[83,"SI","Siena",322,4.8,5.7,9.1,12.4,16.3,21,24,23.7,20.2,14.6,9.8000000000000007,6,null,83,"SI","Siena",322,"2","2,0","NW",null,83,"SI","Siena",322,"43","19","11","19",-2,null,83,"SI","Siena","2,7","2,7","3,7","4,2","5,2","6,5","6,8","9,2","7,8","12,6","8,0","15,2","7,4","17,0","6,7","13,7","5,5","10,0","4,1","6,0","2,9","3,1","2,3","2,0",83,"SIENA","D",166,1943,83,"SIENA","SI",28.3,null,null,83,"SI","Siena","31,3"]
[84,"SR","Siracusa",17,11.3,11.5,13.1,15.4,18.7,23,26.2,26.4,23.9,20.100000000000001,16.399999999999999,12.9,null,84,"SR","Siracusa",17,"3","5,2","W",null,84,"SR","Siracusa",17,"37","04","15","17",5,null,84,"SR","Siracusa","3,4","5,5","4,3","7,8","5,4","11,6","6,4","15,4","6,7","19,3","6,8","20,9","6,3","21,6","5,5","20,2","5,1","15,3","4,2","10,8","3,4","7,2","3,1","4,7",84,"SIRACUSA","B",121,799,84,"SIRACUSA","SR",59.8,null,null,84,"SR","Siracusa","33,1"]
[85,"SO","Sondrio",307,0.5,3.3,8.1999999999999993,12.6,16,20,22.3,21.4,18.100000000000001,12.4,6.6,1.7,null,85,"SO","Sondrio",307,"1","0,8","E",null,85,"SO","Sondrio",307,"46","10","9","52",-10,null,85,"SO","Sondrio","2,3","3,2","3,2","5,7","4,6","9,6","6,4","11,4","7,6","13,8","8,2","14,4","7,8","14,6","6,7","13,4","5,1","10,8","3,7","6,4","2,5","4,2","2,0","2,7",85,"SONDRIO","E",183,2755,85,"SONDRIO","SO",38.700000000000003,null,null,85,"SO","Sondrio","29,9"]
[86,"TA","Taranto",15,9.1999999999999993,9.6999999999999993,11.3,14.5,18.5,23,25.9,25.8,23,18.7,14.4,10.9,null,86,"TA","Taranto",15,"2","5,1","N",null,86,"TA","Taranto",15,"40","27","17","14",0,null,86,"TA","Taranto","3,0","3,8","4,0","5,9","5,4","8,8","6,6","12,9","7,3","16,5","7,0","20,2","6,1","22,0","5,9","18,3","5,3","13,0","4,2","8,4","3,2","4,7","2,7","3,3",86,"TARANTO","C",137,1071,86,"TARANTO","TA",41.7,null,null,86,"TA","Taranto","33,0"]
[87,"TE","Teramo",265,5.0999999999999996,5.9,9,12.8,16.8,21.4,24,23.6,20.399999999999999,15.1,10.4,6.6,null,87,"TE","Teramo",265,"1","1,3","SW",null,87,"TE","Teramo",265,"42","39","13","42",0,null,87,"TE","Teramo","2,8","2,8","3,8","4,6","5,3","7,2","6,8","10,7","7,7","13,6","8,0","15,6","7,1","18,6","6,3","16,2","5,6","10,4","4,2","6,6","3,0","3,6","2,5","2,5",87,"TERAMO","D",166,1834,87,"TERAMO","TE",39.799999999999997,null,null,87,"TE","Teramo","33,0"]
[88,"TR","Terni",130,6.7,7.6,10.7,13.6,17.600000000000001,22.3,24.7,24.3,21.1,16.399999999999999,11.3,6.6,null,88,"TR","Terni",130,"2","2,7","W",null,88,"TR","Terni",130,"42","33","12","38",-2,null,88,"TR","Terni","2,8","2,9","3,8","4,3","5,3","7,2","6,9","8,4","7,9","12,0","8,3","13,5","7,6","16,4","6,8","13,9","5,6","10,6","4,2","6,6","3,0","3,6","2,4","2,3",88,"TERNI","D",166,1650,88,"TERNI","TR",39.799999999999997,null,null,88,"TR","Terni","32,8"]
[89,"TO","Torino",239,0.4,3.2,8.1999999999999993,12.7,16.7,21.1,23.3,22.6,18.8,12.6,6.8,2,null,89,"TO","Torino",239,"1","0,8","NE",null,89,"TO","Torino",239,"45","07","7","43",-8,null,89,"TO","Torino","2,5","2,5","3,5","4,3","5,0","7,2","6,6","10,4","7,9","11,7","8,3","13,2","7,6","15,9","7,0","11,5","5,6","7,9","4,0","5,3","2,7","2,8","2,1","2,6",89,"TORINO","E",183,2617,89,"TORINO","TO",44.4,null,null,89,"TO","Torino","30,7"]
[90,"TP","Trapani",3,11,11.5,13.2,15.8,19.2,23.3,25.8,26.2,24,19.899999999999999,15.8,12.4,null,90,"TP","Trapani",3,"3","6,8","NW",null,90,"TP","Trapani",3,"38","01","12","32",5,null,90,"TP","Trapani","3,3","5,2","4,2","7,2","5,4","11,0","6,4","15,1","6,5","20,0","6,4","22,3","5,8","23,1","5,1","21,2","5,0","15,5","4,2","10,3","3,4","6,5","3,0","4,4",90,"TRAPANI","B",121,810,90,"TRAPANI","TP",59.8,null,null,90,"TP","Trapani","31,6"]
[91,"TN","Trento",194,4.3,7.3,11.8,16.5,20,24,26.3,25.5,22.3,16.399999999999999,10.199999999999999,5.7,null,91,"TN","Trento",194,"1","1,1","N",null,91,"TN","Trento",194,"46","03","11","07",-12,null,91,"TN","Trento","2,3","2,6","3,4","5,0","4,7","9,0","6,5","11,2","7,7","13,2","8,1","15,1","7,3","17,3","6,7","13,5","5,2","10,3","3,8","5,6","2,6","2,9","2,0","2,1",91,"TRENTO","E",183,2567,91,"TRENTO","TN",38.9,null,null,91,"TN","Trento","31,6"]
[92,"TV","Treviso",15,2.8,4.4000000000000004,8.4,13.2,17.100000000000001,21.6,23.8,23.2,19.8,14,8.1999999999999993,4.3,null,92,"TV","Treviso",15,"2","1,0","NE",null,92,"TV","Treviso",15,"45","40","12","14",-5,null,92,"TV","Treviso","2,3","2,2","3,4","4,5","5,0","7,1","6,7","9,2","7,8","12,5","7,9","15,8","7,2","17,3","6,5","14,6","5,4","9,8","3,9","5,7","2,5","2,3","2,0","1,9",92,"TREVISO","E",183,2378,92,"TREVISO","TV",51.8,null,null,92,"TV","Treviso","31,0"]
[93,"TS","Trieste",2,4.9000000000000004,6.2,9.4,13.5,17.7,21.9,24.2,24,20.7,15.5,10.6,6.9,null,93,"TS","Trieste",2,"3","2,6","E",null,93,"TS","Trieste",2,"45","39","13","47",-5,null,93,"TS","Trieste","2,4","1,9","3,5","3,7","5,0","6,1","6,7","8,9","7,8","12,2","8,4","13,1","7,7","15,6","6,7","13,3","5,4","9,4","3,9","5,7","2,6","2,5","2,1","1,8",93,"TRIESTE","D",166,1929,93,"TRIESTE","TS",57.5,null,null,93,"TS","Trieste","31,1"]
[94,"UD","Udine",113,3.5,5,8.6,13.3,17.3,21.1,23.3,23.1,19.8,14.2,8.6999999999999993,4.8,null,94,"UD","Udine",113,"1","1,7","NE",null,94,"UD","Udine",113,"46","03","13","14",-5,null,94,"UD","Udine","2,3","2,1","3,4","3,6","5,0","5,9","6,7","8,6",7.9,"11,1","8,4","11,8","7,9","14,1","6,9","12,0","5,5","8,6","3,8","5,6","2,6","2,4","2,0","2,0",94,"UDINE","E",183,2323,94,"UDINE","UD",57.5,null,null,94,"UD","Udine","31,4"]
[95,"VA","Varese",382,1.2,1.9,6,10.4,14,17.7,20.5,19.600000000000001,16.399999999999999,11.2,5.3,1.9,null,95,"VA","Varese",382,"1","1,3","N",null,95,"VA","Varese",382,"45","49","8","49",-5,null,95,"VA","Varese","2,4","2,6","3,4","3,9","5,0","6,4","6,7","8,7","7,9","11,2","8,4","12,1","8,0","14,0","7,0","11,2","5,5","8,2","3,9","5,1","2,6","3,0","2,1","2,6",95,"VARESE","E",183,2652,95,"VARESE","VA",38.700000000000003,null,null,95,"VA","Varese","29,0"]
[96,"VE","Venezia",1,3.3,4.8,8.6,13.2,17.3,21.3,23.6,23.4,20.399999999999999,14.9,9.5,5,null,96,"VE","Venezia",1,"3","2,6","NE",null,96,"VE","Venezia",1,"45","26","12","20",-5,null,96,"VE","Venezia",2.4,"2,1","3,5","4,6","5,0","7,5","6,6","10,3","7,6","14,3","7,5","18,3","6,4","20,7","6,2","15,9","5,3","10,5","3,9","5,9","2,6","2,7","2,1","2,0",96,"VENEZIA","E",183,2345,96,"VENEZIA","VE",51.8,null,null,96,"VE","Venezia","31,0"]
[97,"VB","Verbania",197,2.9,4.5999999999999996,8.5,12.6,16.600000000000001,20.8,23.3,22.6,19.3,13.5,8.1,4.2,null,97,"VB","Verbania",197,"1","0,9","S",null,97,"VB","Verbania",197,"45","55","8","33",-5,null,97,"VB","Verbania","2,4","2,8","3,4","4,0","5,0","6,4","6,6","10,3","7,9","10,3","8,2","13,8","7,7","15,5","7,0","11,3","5,4","8,9","3,9","5,2","2,6","3,3","2,1","2,6",97,"VERBANIA","E",183,2426,97,"VERBANIA","VB",44.4,null,null,97,"VB","Verbania","30,0"]
[98,"VC","Vercelli",130,0.2,2.9,7.7,12.5,17.2,21.7,23.8,22.8,18.7,12.7,6.5,1.8,null,98,"VC","Vercelli",130,"1","0,8","N",null,98,"VC","Vercelli",130,"45","19","8","25",-7,null,98,"VC","Vercelli","2,4","1,8","3,5","3,6","5,1","6,7","6,6","10,1","7,8","12,3","8,3","13,6","7,4","17,0","6,8","12,8","5,5","8,6","4,0","4,4","2,6","2,2","2,0","1,5",98,"VERCELLI","E",183,2751,98,"VERCELLI","VC",38.700000000000003,null,null,98,"VC","Vercelli","32,0"]
[99,"VR","Verona",59,2.4,4.9000000000000004,9.3000000000000007,13.7,17.399999999999999,21.7,23.8,23.6,20.2,14.7,8.5,4.3,null,99,"VR","Verona",59,"1","0,9","E",null,99,"VR","Verona",59,"45","26","10","59",-5,null,99,"VR","Verona","2,3","1,8","3,5","3,6","5,1","5,9","6,7","8,0","7,9","11,0","8,4","12,3","8,0","13,6","7,0","11,6","5,5","8,8","3,9","5,5","2,6","2,4","2,1","2,1",99,"VERONA","E",166,2468,99,"VERONA","VR",38.9,null,null,99,"VR","Verona","31,6"]
[100,"VI","Vicenza",39,2.4,4.2,8.5,12.9,17,21.3,23.6,23,19.600000000000001,13.9,8.5,4.0999999999999996,null,100,"VI","Vicenza",39,"1","1,3","E",null,100,"VI","Vicenza",39,"45","32","11","32",-5,null,100,"VI","Vicenza","2,3","2,3","3,4","4,0","5,0","6,8","6,6","8,7","7,8","11,6","8,3","13,1","7,9","14,2","6,8","12,7","5,4","9,3","3,8","5,5","2,5","2,9","2,0","2,4",100,"VICENZA","E",183,2371,100,"VICENZA","VI",38.9,null,null,100,"VI","Vicenza","32,6"]
[101,"VT","Viterbo",326,5.7,6.6,9.4,12.7,16.899999999999999,21.8,24.8,24,20.7,15.9,11.3,7.5,null,101,"VT","Viterbo",326,"2","4,0","NE",null,101,"VT","Viterbo",326,"42","25","12","06",-2,null,101,"VT","Viterbo","2,8","3,1","3,8","4,7","5,3","7,6","6,8","9,4","7,7","13,2","8,1","14,8",7.4,"17,4","6,6","14,7","5,5",11.2,"4,1","7,2","3,0","3,9","2,4","2,6",101,"VITERBO","D",166,1989,101,"VITERBO","VT",39.799999999999997,null,null,101,"VT","Viterbo","31,0"]