{"text_format":"1","workbook":"xlsx","n_sheets":25,"sheets":["bianco","Autenticazione","inizio","variabili","Dati","fabb_ACS","fabb_risc","UNI8477","riepilogo","grafico1","relazione","Dettaglio mesi","ammortamento","cti_show","relazione_amm","incentivi","cti","fc","Tabelle","Tabelle5","Tabelle6","CT20","tab_bollitore","Tab_UNI","cashflow"],"not_rendered":{"charts":4,"images":22,"macros":1,"external_links":1,"defined_names":119,"comments":4,"pivot_tables":0},"unopened":[],"bounds":{"document_bytes":16777216,"sheet_cells":100000,"rows_first":2000,"rows_last":500,"rows_between":2000,"halvings":0,"cell_chars":16384,"cell_head_chars":4096},"cells_cut":0,"cells_raw":0,"read":"whole","date_system":"1900"}

{"sheet":"bianco","index":0,"n_rows":0,"n_cols":0,"rows_kept":0,"cut":false,"hidden":false,"merged":[]}

{"sheet":"Autenticazione","index":1,"n_rows":47,"n_cols":12,"rows_kept":47,"cut":false,"hidden":false,"merged":[[16,6,16,7],[5,1,5,7],[11,3,11,4],[11,6,11,7],[12,3,12,4],[12,6,12,7],[8,3,8,7],[9,3,9,4],[6,6,6,7],[9,6,9,7],[10,3,10,7],[14,2,14,7],[13,3,13,7]]}
[]
[null,"Richiesta di licenza d'uso per il programma ParaSol FC",null,null,null,null,null,null,null,null,"Password aspettata"]
[null,null,null,null,null,null,null,null,null,null,{"$f":"100000+ROUND(+SQRT(codice_utente),0)","v":107816}]
[null,"Inviare via mail a marketing@paradigmaitalia.it",null,null,null,null,null,null,null,null,"Giusta?",{"$f":"IF(OR(passord_OK=password,password=\"0321Para\"),\"OK\",\"KO\")","v":"OK"}]
[]
[]
[null,"Riservato all'ufficio Paradigma.",null,"Il vostro codice di abilitazione è:",null,null,"0321Para"]
[]
{"$rows_left_out":40}
{"sheet":"inizio","index":2,"n_rows":20,"n_cols":6,"rows_kept":20,"cut":false,"hidden":false,"merged":[]}
[]
[]
[]
[]
[]
[]
[]
[null,null,"Dati generali impianto",null,null,"Energia solare mensile incidente sui collettori"]
{"$rows_left_out":13}
{"sheet":"variabili","index":3,"n_rows":29,"n_cols":14,"rows_kept":29,"cut":false,"hidden":true,"merged":[]}
["Accetto condizioni",null,true]
["Fabbisogni scelti"]
[null,"ACS",true,null,{"$f":"+IF(ACS,\"ACS\",\"\")&IF(ACS,IF(INTEGRAZ,\" - \",\"\"),\"\")&IF(INTEGRAZ,\"RISC\",\"\")","v":"ACS - RISC"}]
[null,"INTEGRAZ",true]
[]
[null,null,null,null,null,null,null,null,null,null,null,null,"Fogli:"]
["Località scelta",null,6,null,null,null,null,null,"elenco valori in TabelleUNI, A5:C105",null,null,null,"tab_UNI","OK"]
[null,null,null,null,null,null,null,null,null,null,null,null,"tab_bollitore","OK"]
{"$rows_left_out":22}
{"sheet":"Dati","index":4,"n_rows":18,"n_cols":18,"rows_kept":18,"cut":false,"hidden":false,"merged":[[4,2,4,19],[5,4,5,9],[7,4,7,9],[15,5,15,6],[18,4,18,7],[9,2,9,19],[14,2,14,19],[13,2,13,19],[17,3,17,6],[16,2,16,7]]}
[]
[]
[]
[]
[null,null,"Dati impianto"]
[null,null,"Committente:",null,"Nome committente",null,null,null,null,null,null,"Provincia:",null,{"$f":"VLOOKUP(localitascelta,Tab_UNI!AJ5:AL105,3,FALSE)","v":"Ascoli Piceno"},null,null,null,{"$f":"+\"Lat. = \"&VLOOKUP(localitascelta,Tab_UNI!Z5:AG105,5,FALSE)&\"°\"","v":"Lat. = 42°"}]
[]
[null,null,"Riferimento:",null,"Riferimento impianto"]
{"$rows_left_out":11}
{"sheet":"fabb_ACS","index":5,"n_rows":24,"n_cols":15,"rows_kept":24,"cut":false,"hidden":false,"merged":[[19,6,19,7],[20,6,20,7],[11,2,11,13],[16,6,16,7],[17,6,17,7],[18,6,18,7]]}
[]
[]
[]
[]
[null,null,"Consumi:",{"$f":"IF(Tabelle5!H28=\"SI\",\"Altro utilizzo\",+Tabelle5!B28)","v":"abitazione S > 200 m2"},null,null,null,null,"Temperature:",null,"utilizzo:",40,null,"Valore UNI:\n40°C",45]
[null,null,null,{"$f":"IF(D5=\"altro utilizzo\",\"\",+Tabelle5!D28)","v":3.13},{"$f":"+Tabelle5!E28","v":"litri/G m2"},null,null,null,null,null,"ingresso:",{"$f":"+ROUND(Tabelle5!C39,0)","v":15},"Valore UNI non modificabile",null,12]
[null,null,null,{"$f":"IF(D5=\"altro utilizzo\",\"\",+Tabelle5!G28)","v":80},{"$f":"+Tabelle5!J28","v":"m2/alloggio (1 alloggi)"},null,null,null,null,null,null,null,null,null,8]
[null,null,null,{"$f":"+Tabelle5!H34","v":250},"litri / giorno (Vw)",null,null,null,"Profilo utilizzo:",null,"annuale",{"$f":"+Tabelle!B64","v":"sempre 100%"}]
{"$rows_left_out":17}
{"sheet":"fabb_risc","index":6,"n_rows":40,"n_cols":15,"rows_kept":40,"cut":false,"hidden":false,"merged":[[18,4,18,5]]}
[]
[]
[]
[]
[]
[null,null,"Inserire i fabbisogni per il riscaldamento / raffrescamento (kWh / mese):"]
[null,null,null,"gen","feb","mar","apr","mag","giu","lug","ago","set","ott","nov","dic"]
[]
{"$rows_left_out":33}
{"sheet":"UNI8477","index":7,"n_rows":28,"n_cols":17,"rows_kept":28,"cut":false,"hidden":false,"merged":[[4,15,6,15],[4,3,6,3],[2,5,2,15],[4,11,6,11],[4,12,6,12],[4,13,6,13],[4,14,6,14],[4,7,6,7],[4,10,6,10],[4,4,6,4],[4,8,6,8],[4,9,6,9],[4,5,6,5],[4,6,6,6],[26,2,26,3],[27,2,27,3],[24,4,24,5],[25,4,25,5],[26,4,26,5],[27,4,27,5],[24,2,24,3],[25,2,25,3]]}
[]
[]
[]
[]
[null,null,null,"Un.Mis","Gennaio","Febbraio","Marzo","Aprile","Maggio","Giugno","Luglio","Agosto","Settembre","Ottobre","Novembre","Dicembre"]
[]
[]
[null,null,"Hh","MJ/m2g",{"$f":"'Dettaglio mesi'!E6","v":5.4},{"$f":"'Dettaglio mesi'!F6","v":8.1999999999999993},{"$f":"'Dettaglio mesi'!G6","v":12.6},{"$f":"'Dettaglio mesi'!H6","v":17.2},{"$f":"'Dettaglio mesi'!I6","v":20.8},{"$f":"'Dettaglio mesi'!J6","v":23.7},{"$f":"'Dettaglio mesi'!K6","v":25.6},{"$f":"'Dettaglio mesi'!L6","v":22.3},{"$f":"'Dettaglio mesi'!M6","v":16.3},{"$f":"'Dettaglio mesi'!N6","v":10.4},{"$f":"'Dettaglio mesi'!O6","v":6.4},{"$f":"'Dettaglio mesi'!P6","v":4.8}]
{"$rows_left_out":21}
{"sheet":"riepilogo","index":8,"n_rows":57,"n_cols":14,"rows_kept":57,"cut":false,"hidden":false,"merged":[[5,6,5,8],[6,11,6,12],[5,9,5,13],[56,2,56,13],[55,2,55,13],[54,2,54,13],[6,9,6,10]]}
[]
[]
[]
[]
[]
[null,null,null,null,"Radiazione","Energia fornita","Fabbisogno al generatore (*)",null,null,"Copertura"]
[null,null,null,null,"sui collett.","imp.solare","ACS","Riscald.","Totale","ACS",null,"RISCALDAMENTO",null,"Totale"]
[null,null,null,null,"kWh","kWh","kWh","kWh","kWh","kWh","%","kWh","%","%"]
{"$rows_left_out":50}
{"sheet":"grafico1","index":9,"n_rows":0,"n_cols":0,"rows_kept":0,"cut":false,"hidden":true,"merged":[]}

{"sheet":"relazione","index":10,"n_rows":133,"n_cols":13,"rows_kept":133,"cut":false,"hidden":false,"merged":[[121,10,123,12],[121,4,123,5],[121,6,123,6],[121,7,123,9],[105,7,108,9],[105,10,108,11],[112,6,115,9],[112,10,115,11],[89,2,91,13],[5,5,5,9],[6,5,6,9],[7,5,7,6],[70,5,70,7],[70,8,70,12]]}
[]
[]
[]
[null,null,null,"Simulazione impianto solare"]
[]
[null,null,null,"Committente:",null,{"$f":"+committente","v":"Nome committente"}]
[null,null,null,"Riferimento:",null,{"$f":"+riferimento","v":"Riferimento impianto"}]
[null,null,null,"Data:",null,{"$f":"+TODAY()","v":"2021-01-26"}]
{"$rows_left_out":126}
{"sheet":"Dettaglio mesi","index":11,"n_rows":52,"n_cols":16,"rows_kept":52,"cut":false,"hidden":true,"merged":[]}
[null,null,null,null,"GENNAIO","FEBBRAIO","MARZO","APRILE","MAGGIO","GIUGNO","LUGLIO","AGOSTO","SETTEMBRE","OTTOBRE","NOVEMBRE","DICEMBRE"]
["Componente diffusa della radiazione",null,"Hdh","MJ/m2",{"$f":"VLOOKUP(localitascelta,Tab_UNI!AJ5:BJ105,4,FALSE)","v":2.8},{"$f":"VLOOKUP(localitascelta,Tab_UNI!AJ5:BJ105,6,FALSE)","v":"3,8"},{"$f":"VLOOKUP(localitascelta,Tab_UNI!AJ5:BJ105,8,FALSE)","v":"5,3"},{"$f":"VLOOKUP(localitascelta,Tab_UNI!AJ5:BJ105,10,FALSE)","v":"6,8"},{"$f":"VLOOKUP(localitascelta,Tab_UNI!AJ5:BJ105,12,FALSE)","v":"7,8"},{"$f":"VLOOKUP(localitascelta,Tab_UNI!AJ5:BJ105,14,FALSE)","v":"8,0"},{"$f":"VLOOKUP(localitascelta,Tab_UNI!AJ5:BJ105,16,FALSE)","v":"7,1"},{"$f":"VLOOKUP(localitascelta,Tab_UNI!AJ5:BJ105,18,FALSE)","v":"6,3"},{"$f":"VLOOKUP(localitascelta,Tab_UNI!AJ5:BJ105,20,FALSE)","v":"5,5"},{"$f":"VLOOKUP(localitascelta,Tab_UNI!AJ5:BJ105,22,FALSE)","v":"4,2"},{"$f":"VLOOKUP(localitascelta,Tab_UNI!AJ5:BJ105,24,FALSE)","v":"3,0"},{"$f":"VLOOKUP(localitascelta,Tab_UNI!AJ5:BJ105,26,FALSE)","v":"2,5"}]
["Componente diretta della radiazione",null,"Hbh","MJ/m2",{"$f":"VLOOKUP(localitascelta,Tab_UNI!AJ5:BJ105,5,FALSE)","v":"2,6"},{"$f":"VLOOKUP(localitascelta,Tab_UNI!AJ5:BJ105,7,FALSE)","v":"4,4"},{"$f":"VLOOKUP(localitascelta,Tab_UNI!AJ5:BJ105,9,FALSE)","v":"7,3"},{"$f":"VLOOKUP(localitascelta,Tab_UNI!AJ5:BJ105,11,FALSE)","v":"10,4"},{"$f":"VLOOKUP(localitascelta,Tab_UNI!AJ5:BJ105,13,FALSE)","v":"13,0"},{"$f":"VLOOKUP(localitascelta,Tab_UNI!AJ5:BJ105,15,FALSE)","v":"15,7"},{"$f":"VLOOKUP(localitascelta,Tab_UNI!AJ5:BJ105,17,FALSE)","v":"18,5"},{"$f":"VLOOKUP(localitascelta,Tab_UNI!AJ5:BJ105,19,FALSE)","v":"16,0"},{"$f":"VLOOKUP(localitascelta,Tab_UNI!AJ5:BJ105,21,FALSE)","v":"10,8"},{"$f":"VLOOKUP(localitascelta,Tab_UNI!AJ5:BJ105,23,FALSE)","v":"6,2"},{"$f":"VLOOKUP(localitascelta,Tab_UNI!AJ5:BJ105,25,FALSE)","v":"3,4"},{"$f":"VLOOKUP(localitascelta,Tab_UNI!AJ5:BJ105,27,FALSE)","v":"2,3"}]
["Riflettanza ambiante circostante",null,"r",null,0.22,0.22,0.22,0.22,0.22,0.22,0.22,0.22,0.22,0.22,0.22,0.22]
["Ennesimo giorno dell'anno",null,"n",null,17,47,75,105,135,162,198,228,258,288,318,344]
["Radiazione media globale al suolo sul piano orizzontale  UNI",null,"Hh","MJ/m2",{"$f":"E3+E2","v":5.4},{"$f":"F3+F2","v":8.1999999999999993},{"$f":"G3+G2","v":12.6},{"$f":"H3+H2","v":17.2},{"$f":"I3+I2","v":20.8},23.7,25.6,22.3,16.3,10.4,6.4,4.8]
["Declinazione solare",null,"d","gradi °",{"$f":"23.45*SIN((360*(E5+284)/365)/180*PI())","v":-20.916962574476418},{"$f":"23.45*SIN((360*(F5+284)/365)/180*PI())","v":-12.954608093780696},{"$f":"23.45*SIN((360*(G5+284)/365)/180*PI())","v":-2.4177348051423611},{"$f":"23.45*SIN((360*(H5+284)/365)/180*PI())","v":9.4148933468800529},{"$f":"23.45*SIN((360*(I5+284)/365)/180*PI())","v":18.791917517696167},23.085911002836561,21.183693564513842,13.454959682356431,2.2168867832133041,-9.5993972342263003,-18.911954741226136,-23.049627643930577]
[null,null,null,"rad",{"$f":"E7/180*PI()","v":-0.36506986644104311},-0.22610056454197949,-4.2197432789797727E-2,0.16432088762716554,0.32798083344699785,0.40292515782188393,0.36972520043430035,0.23483334718021009,3.869197351101792E-2,-0.16754108794408623,-0.33007587822254825,-0.40229189374529173]
{"$rows_left_out":45}
{"sheet":"ammortamento","index":12,"n_rows":26,"n_cols":8,"rows_kept":26,"cut":false,"hidden":false,"merged":[[19,2,20,10],[23,2,24,10],[6,7,6,8],[13,7,13,8]]}
[]
[]
[]
[]
[]
[null,null,"Costo stimato impianto:",null,null,null,null,"Costo annuo manutenz. [euro]:"]
[null,null,7000,"€",null,null,null,0]
[]
{"$rows_left_out":19}
{"sheet":"cti_show","index":13,"n_rows":49,"n_cols":12,"rows_kept":49,"cut":false,"hidden":false,"merged":[[48,3,48,10]]}
[]
[]
[]
[null,null,null,"Calcolo energia primaria per produzione A.C.S. (secondo UNI TS 11300-5)"]
[]
[null,null,null,"Rendimenti considerati:"]
[]
[null,null,null,"h w,er","- Rendimento di erogazione",null,null,{"$f":"+cti!E2","v":1}]
{"$rows_left_out":42}
{"sheet":"relazione_amm","index":14,"n_rows":39,"n_cols":10,"rows_kept":39,"cut":false,"hidden":false,"merged":[[38,2,40,11],[34,3,35,10],[6,5,6,9],[7,5,7,9],[9,5,9,6]]}
[]
[]
[]
[null,null,null,"Simulazione impianto solare"]
[null,null,null,"Foglio previsione ammortamento"]
[]
[null,null,null,"Committente:",null,{"$f":"+Dati!E6","v":"Nome committente"}]
[null,null,null,"Riferimento:",null,{"$f":"+Dati!E8","v":"Riferimento impianto"}]
{"$rows_left_out":32}
{"sheet":"incentivi","index":15,"n_rows":47,"n_cols":10,"rows_kept":47,"cut":false,"hidden":true,"merged":[]}
[]
[]
[null,null,null,null,"% sgravio","massimale incentivo","testo1","testo2","> 50 m2","< 50 m2"]
[null,null,1,"Detrazioni fiscali per efficienza energetica (65%)",65,60000,"Detrazioni fiscali = 65%","Valore massimo detrazione = 60.000 € in 10 rate annuali."]
[null,null,2,"Detrazioni fiscali per ristrutturazione (50%)",50,48000,"Detrazioni fiscali = 50%","Valore massimo detrazione = 48.000 € in 10 rate annuali."]
[null,null,3,"Conto energia 2.0 per ACS",null,null,"nel caso di Plasma, calcolo effettuato con AP 15/40 - nel caso di Star, con Star 15/39","il calcolo è approssimato nel caso in cui la superficie inserita non sia multriplo esatto",55,170]
[null,null,4,"Conto energia 2.0 per ACS, riscaldamento",null," ","nel caso di Plasma, calcolo effettuato con AP 15/40 - nel caso di Star, con Star 15/39","il calcolo è approssimato nel caso in cui la superficie inserita non sia multriplo esatto",83,255]
[null,null,5,"Conto energia 2.0 per calore di processo",null,null,"nel caso di Plasma, calcolo effettuato con AP 15/40 - nel caso di Star, con Star 15/39","il calcolo è approssimato nel caso in cui la superficie inserita non sia multriplo esatto"]
{"$rows_left_out":40}
{"sheet":"cti","index":16,"n_rows":60,"n_cols":33,"rows_kept":60,"cut":false,"hidden":true,"merged":[]}
[]
["erogazione","eta,w,er",null,null,1,"Valore precedente pari a 0,95 ed ora aggiornato a 1 secondo 11300 del 2014"]
[]
[null,null,null,"descrizione","f l,d,w"]
["distribuzione","eta, w,d",0,"Sistemi installati prima dell'entrata in vigore della legge 373/76",0.12]
[null,null,1,"Sistemi installati dopo dell'entrata in vigore della legge 373/76",0.08]
[null,null,1,{"$f":"+VLOOKUP(C7,C5:E6,2)","v":"Sistemi installati dopo dell'entrata in vigore della legge 373/76"},{"$f":"+VLOOKUP(C7,C5:E6,3)","v":0.08},{"$f":"1-E7","v":0.92},null,null,null,null,null,null,null,null,null,null,null,null,"potenza elettrica caldaia per acs",0.1,"kW"]
[]
{"$rows_left_out":53}
{"sheet":"fc","index":17,"n_rows":55,"n_cols":34,"rows_kept":55,"cut":false,"hidden":true,"merged":[]}
[]
[]
[null,"Fabbisogno applicato all'impianto solare per acqua calda sanitaria",null,null,null,null,null,null,"QW,gn,out",{"$f":"+S47","v":3698.2347500000001},"kWh/anno",null,null,null,null,null,null,null,null,null,"XH","XW","YH","YW"]
[null,"Fabbisogno applicato all'impianto solare per riscaldamento",null,null,null,null,null,null,"QH,gn,out",{"$f":"+R47","v":3685.5000000000009},"kWh/anno"]
[null,null,null,null,null,null,null,null,null,null,null,null,null,null,null,null,null,null,null,null,{"$f":"+$F35*$D$20*$D$22*Q35*$J35*M35/(R35*1000)","v":0.42417892031441351},{"$f":"+$G35*$D$20*$D$22*P35*$K35*M35/(S35*1000)","v":0.46655192568762044},{"$f":"+$F35*$J$10*$J$7*$D$22*W35/(R35*1000)","v":0.12393096521454382},{"$f":"+$G35*$J$10*$J$7*$D$22*W35/(S35*1000)","v":0.12393096521454379}]
[null,"Superficie di apertura collettore solare",null,null,null,null,null,null,"A",{"$f":"+superficie","v":2.4},"m2",null,null,null,null,null,null,null,null,null,0.41258972136629968,{"$f":"+$G36*$D$20*$D$22*P36*$K36*M36/(S36*1000)","v":0.44787630267544315},0.16124247044113832,{"$f":"+$G36*$J$10*$J$7*$D$22*W36/(S36*1000)","v":0.16124247044113832}]
[null,"Coefficienti collettore solare",null,null,null,null,null,null,"h0",{"$f":"+eta0","v":0.68700000000000006},null,null,null,null,null,null,null,null,null,null,0.50280810487503613,0.52592061002730273,0.2610351813733533,0.2610351813733533]
[null,null,null,null,null,null,null,null,"a1",{"$f":"+kappa1","v":0.61299999999999999},null,null,null,null,null,null,null,null,null,null,0.61175245552078983,0.60571254661737783,0.37614324939914079,0.37614324939914079]
{"$rows_left_out":48}
{"sheet":"Tabelle","index":18,"n_rows":67,"n_cols":22,"rows_kept":67,"cut":false,"hidden":true,"merged":[]}
[null,null,null,null,null,null,null,null,"**","**"]
["Rendimento pannellli",null,"eta0","a1","a2","RADdiff","IAM (50)","TIPO","R.app.inv.","R.app.est"]
[1,"--- Scegliere tipo pannello ---",0,0,0,0,0,"CPC",0,0]
[2,"Star",0.64400000000000002,0.749,5.0000000000000001E-3,1,1,"CPC",0.5,0.61,null,null,"Ex pannelli:"]
[3,"CSO 21",0.745,2.0070000000000001,5.0000000000000001E-3,0.9,1,"CSO",0.5,0.61]
[4,"AQUA PLASMA",0.68700000000000006,0.61299999999999999,3.0000000000000001E-3,1,1,"CPC",0.5,0.61,null,null,"Rendimento pannellli",null,"eta0","a1","a2","RADdiff","IAM (50)","TIPO","R.app.inv.","R.app.est"]
[5,"EasySun PLUS",0.79378749999999998,3.7739166666666666,1.3704166666666665E-2,0.85,0.92,"PIANO",0.4,0.6,null,null,5,"EasySun II",0.80100000000000005,3.65,1.6899999999999998E-2,0.85,0.94,"PIANO",0.4,0.6]
[6]
{"$rows_left_out":60}
{"sheet":"Tabelle5","index":19,"n_rows":56,"n_cols":20,"rows_kept":56,"cut":false,"hidden":true,"merged":[]}
[null,"Tipo","UnitàMisura","Litri",null,"litri * UM",null,null,null,"testo nel foglio FABB ACS"]
[0,"abitazione S < 35 m2","m2",{"$f":"+ROUND(F2/unita_misura,2)","v":0.63},"litri/G m2",{"$f":"+(0*unita_misura+50)*num_alloggi","v":50},null,null,null,{"$f":"\"m2/alloggio\"&\" (\"&num_alloggi&\" alloggi)\"","v":"m2/alloggio (1 alloggi)"},null,null,1,"Abitazioni",{"$f":"+IF(tipologia_sanitario=1,TRUE,FALSE)","v":true},null,null,"si",true,"elenco possibilità di casella scelta in parasol web"]
[1,"abitazione 35 < S < 50 m2","m2",{"$f":"+ROUND(F3/unita_misura,2)","v":2.13},"litri/G m2",{"$f":"+(2.667*unita_misura-43.33)*num_alloggi","v":170.02999999999997},1,"numero alloggi",null,{"$f":"\"m2/alloggio\"&\" (\"&num_alloggi&\" alloggi)\"","v":"m2/alloggio (1 alloggi)"},null,null,2,"Altri utilizzi",{"$f":"+IF(tipologia_sanitario=2,TRUE,FALSE)","v":false},null,null,"no",false]
[2,"abitazione 50 < S < 200 m2","m2",{"$f":"+ROUND(F4/unita_misura,2)","v":1.53},"litri/G m2",{"$f":"+(1.067*unita_misura+36.67)*num_alloggi","v":122.03},null,null,null,{"$f":"\"m2/alloggio\"&\" (\"&num_alloggi&\" alloggi)\"","v":"m2/alloggio (1 alloggi)"},null,null,1]
[3,"abitazione S > 200 m2","m2",{"$f":"+ROUND(F5/unita_misura,2)","v":3.13},"litri/G m2",{"$f":"+(0*unita_misura+250)*num_alloggi","v":250},null,null,null,{"$f":"\"m2/alloggio\"&\" (\"&num_alloggi&\" alloggi)\"","v":"m2/alloggio (1 alloggi)"}]
[4,null,null,null,null,{"$f":"+D6*unita_misura","v":0}]
[5,"Dormitori, residence, B&B","letti",40,"litri/G per letto",3200,null,null,null,"letti",null,null,{"$f":"+B7&\" - \"&D7&\" \"&E7&\" - inserire \"&C7","v":"Dormitori, residence, B&B - 40 litri/G per letto - inserire letti"},null,null,null,null,null,false,"usato in web per non visualizzare una domanda"]
[6,"Hotel fino a 3 stelle","letti",60,"litri/G per letto",4800,null,null,null,"letti",null,null,{"$f":"+B8&\" - \"&D8&\" \"&E8&\" - inserire \"&C8","v":"Hotel fino a 3 stelle - 60 litri/G per letto - inserire letti"}]
{"$rows_left_out":49}
{"sheet":"Tabelle6","index":20,"n_rows":73,"n_cols":16,"rows_kept":73,"cut":false,"hidden":true,"merged":[]}
["verificato"]
[null,null,null,null,null,null,null,null,null,null,null,"Fattore conversione in energia primaia"]
[null,"Tipo","Rend.","Rend. ACS","Combust.","prezzo",null,null,"potere",null,"kg CO2 su unità","fp tot","€/kWh","fp nren","fp ren","PDC?"]
[1,"Caldaia a condens. 4*",91,90,"metano",0.85,"€ / m3","m3 di metano",9500,"Wh/m3",1.97,1.05,{"$f":"+F4/I4*1000","v":8.9473684210526316E-2},1.05,0,false]
[2,"Caldaia 3*",87,86,"metano",0.85,"€ / m3","m3 di metano",9500,"Wh/m3",1.97,1.05,8.9473684210526316E-2,1.05,0,false]
[3,"Pompa di calore aria-acqua",390,210,"elettricità",0.2,"€ / kWh el","kWh el",1000,"Wh/kWh el",0.41,2.42,0.2,1.95,0.47,true]
[4,"Caldaia a gasolio, monostadio",85,80,"gasolio",1.25,"€ / litro","litri di gasolio",9800,"Wh/litro",2.66,1.07,0.12755102040816327,1.07,0,false]
[5,"Caldaia a GPL",85,80,"gpl",1.1499999999999999,"€ / litro","litri di GPL",6900,"Wh/litro",1.73,1.05,0.16666666666666666,1.05,0,false]
{"$rows_left_out":66}
{"sheet":"CT20","index":21,"n_rows":25,"n_cols":18,"rows_kept":25,"cut":false,"hidden":true,"merged":[[0,3,0,4],[0,5,0,6],[0,7,0,8],[8,2,8,6]]}
[null,null,"Ag","Qcol (kWh)",null,"Qu (kWh/m2)",null,"Sl",null,"Qu * Sl (kWh)"]
[null,null,"Sup lorda m2","50°C","75°C","50°C","75°C","nr","m2","50°C","75°C",null,null,null,null,"Dal foglio \"Tabelle\""]
[1,"STAR 15/39",3.93,2313,1997,{"$f":"D3/C3","v":588.54961832061065},{"$f":"E3/C3","v":508.1424936386768},{"$f":"+superficie/L3","v":0.68571428571428572},{"$f":"H3*C3","v":2.6948571428571428},{"$f":"+I3*F3","v":1586.0571428571427},{"$f":"+I3*G3","v":1369.3714285714284},3.5,null,null,null,1,"Star"]
[2,"CSO21",2.38,1201,1004,{"$f":"D4/C4","v":504.62184873949582},{"$f":"E4/C4","v":421.84873949579833},{"$f":"+superficie/L4","v":1.8045112781954886},{"$f":"H4*C4","v":4.2947368421052623},{"$f":"+I4*F4","v":2167.2180451127815},{"$f":"+I4*G4","v":1811.7293233082703},1.33,null,null,null,2,"CSO 21"]
[3,"PLASMA 15/40",3.99,2568,2316,{"$f":"D5/C5","v":643.60902255639098},{"$f":"E5/C5","v":580.45112781954879},{"$f":"+superficie/L5","v":0.68571428571428572},{"$f":"H5*C5","v":2.7360000000000002},{"$f":"+I5*F5","v":1760.9142857142858},{"$f":"+I5*G5","v":1588.1142857142856},3.5,null,null,null,3,"AQUA PLASMA"]
[4,"EasySun II",2.15,938,544,{"$f":"D6/C6","v":436.27906976744185},{"$f":"E6/C6","v":253.02325581395351},{"$f":"+superficie/L6","v":1.2},{"$f":"H6*C6","v":2.5799999999999996},{"$f":"+I6*F6","v":1125.5999999999999},{"$f":"+I6*G6","v":652.79999999999995},2,null,null,null,4,"EasySun II"]
[{"$f":"+pannelloscelto","v":4},null,null,null,null,null,null,null,{"$f":"+VLOOKUP(A7,A3:I6,9,FALSE)","v":2.5799999999999996},{"$f":"+VLOOKUP(A7,A3:K6,10,FALSE)","v":1125.5999999999999},{"$f":"+VLOOKUP(A7,A3:K6,11,FALSE)","v":652.79999999999995},null,null,null,null,{"$f":"+pannelloscelto","v":4},null,"pannello scelto"]
[]
{"$rows_left_out":18}
{"sheet":"tab_bollitore","index":22,"n_rows":60,"n_cols":11,"rows_kept":60,"cut":false,"hidden":true,"merged":[]}
[]
[]
[null,null,"V (litri)","K (W/K)","Vbu/Vnom",null,"Vbu"]
[0,"Aqua 200",216,1.22,{"$f":"+G4/C4","v":0.32870370370370372},null,71]
[1,"Aqua 300",310,1.47,{"$f":"+G5/C5","v":0.41935483870967744},null,130]
[2,"Aqua 400",428,1.56,{"$f":"+G6/C6","v":0.39018691588785048},null,167]
[3,"Aqua 500",543,1.64,{"$f":"+G7/C7","v":0.40883977900552487},null,222]
[4,"AquaSunPlus 200",212,1.49,{"$f":"+G8/C8","v":0.44811320754716982},null,95]
{"$rows_left_out":53}
{"sheet":"Tab_UNI","index":23,"n_rows":105,"n_cols":77,"rows_kept":105,"cut":false,"hidden":true,"merged":[[1,48,1,49],[1,58,1,59],[1,60,1,61],[1,50,1,51],[1,52,1,53],[1,54,1,55],[1,56,1,57],[2,25,3,25],[2,27,3,27],[2,29,2,30],[2,31,2,32],[1,46,1,47],[1,42,1,43],[1,44,1,45],[2,35,3,35],[2,37,3,37],[1,38,1,39],[1,40,1,41],[0,0,0,15],[0,17,0,23],[2,17,3,17],[2,19,3,19],[2,0,3,0],[2,2,3,2]]}
["Prospetto VI - Valori medi mensili della temperatura media giornaliera dell'aria esterna",null,null,null,null,null,null,null,null,null,null,null,null,null,null,null,null,"Prospetto XIV - Velocità giornaliera del vento - Media annuale",null,null,null,null,null,null,null,"Latitudine"]
[null,null,null,null,null,null,null,null,null,null,null,null,null,null,null,null,null,null,null,null,null,null,null,null,null,null,null,null,null,null,null,null,null,null,null,null,null,null,"GEN.",null,"FEB.",null,"MAR.",null,"APR.",null,"MAG.",null,"GIU.",null,"LUG.",null,"AGO.",null,"SET.",null,"OTT.",null,"NOV.",null,"DIC."]
["N°","Sigla","Località","Altitudine","GEN.","FEB.","MAR.","APR.","MAG.","GIU.","LUG.","AGO."," SET.","OTT.","NOV.","DIC.",null,"N°","Sigla","Località","Altitudine","Zona di","w","Direzione",null,"N°","Sigla","Località","Altitudine","Latitudine",null,"Longitudine",null,"T min ext",null,"N°","Sigla","Località","Hd h","Hb h","Hd h","Hb h","Hd h","Hb h","Hd h","Hb h","Hd h","Hb h","Hd h","Hb h","Hd h","Hb h","Hd h","Hb h","Hd h","Hb h","Hd h","Hb h","Hd h","Hb h","Hd h","Hb h"]
[null,"Provincia",null,"m","°C","°C","°C","°C","°C","°C","°C","°C","°C","°C","°C","°C",null,null,"Provincia",null,"m","vento","m/s","prevalente",null,null,"Provincia",null,"m","°","  '","°","  '",null,null,null,"Prov",null,"MJ/m2","MJ/m2","MJ/m2","MJ/m2","MJ/m2","MJ/m2","MJ/m2","MJ/m2","MJ/m2","MJ/m2","MJ/m2","MJ/m2","MJ/m2","MJ/m2","MJ/m2","MJ/m2","MJ/m2","MJ/m2","MJ/m2","MJ/m2","MJ/m2","MJ/m2","MJ/m2","MJ/m2",null,"COMUNE","ZonaClimat","PeriodoRis","GradGiorno",null,"COMUNE","ProvSigla","UmRelEST",null,null,"TEMP.MAX.ESTIVA"]
[1,"AG","Agrigento",230,10.4,10.8,12.7,15.6,19.399999999999999,24.1,26.9,26.5,24,19.899999999999999,15.9,12.2,null,1,"AG","Agrigento",230,"3",4.5,"NW",null,1,"AG","Agrigento",230,"37","18","13","35",3,null,1,"AG","Agrigento",3.4,"5,4","4,2","8,3","5,3","11,6","6,2","16,0","6,3","20,6","6,0","23,5","5,4","24,2","4,8","22,2","4,9","16,0","4,3","10,3","3,5","6,6","3,0","5,2",1,"AGRIGENTO","B",121,729,1,"AGRIGENTO","AG",59.8,null,null,1,"AG","Agrigento","33,0"]
[2,"AL","Alessandria",95,0,2.8,8.1,13.1,17.3,22,24.7,23.6,19.899999999999999,13.1,6.9,1.9,null,2,"AL","Alessandria",95,"1",1.2,"SE",null,2,"AL","Alessandria",95,"44","54","8","36",-8,null,2,"AL","Alessandria",2.4,"2,3","3,5","4,0","5,1","6,5","6,7","9,1","7,9","10,6","8,4","12,1","7,7","14,9","7,0","11,0","5,6","7,8","4,0","4,5","2,7","2,6","2,1","2,1",2,"ALESSANDRIA","E",183,2559,2,"ALESSANDRIA","AL",44.4,null,null,2,"AL","Alessandria","30,5"]
[3,"AN","Ancona",16,6.3,7.1,9.9,13.4,17,21.8,24.4,24.1,21.3,16.5,12.1,7.8,null,3,"AN","Ancona",16,"2",3.2,"W",null,3,"AN","Ancona",16,"43","36","16","30",-2,null,3,"AN","Ancona",2.5,"1,8","3,7","3,9","5,2","6,9","6,6","11,7","7,4","15,7","7,9","16,2","6,9","19,1","6,4","15,6","5,4","10,6","4,1","6,4","2,8","2,7","2,3","1,8",3,"ANCONA","D",166,1688,3,"ANCONA","AN",37,null,null,3,"AN","Ancona","30,1"]
[4,"AO","Aosta",583,-0.3,2.6,6.7,11,14.7,18.7,20.5,19.399999999999999,15.9,10.3,4.8,0.8,null,4,"AO","Aosta",583,"2",2.6,"N",null,4,"AO","Aosta",583,"45","44","7","18",-10,null,4,"AO","Aosta",2.4,"2,9","3,4","4,6","4,9","7,2","6,7","9,0","7,9","10,3","8,4","11,5","8,0","13,0","7,1","10,4","5,6","7,6","3,9","4,8","2,6","3,5","2,1","2,7",4,"AOSTA","E",183,2850,4,"AOSTA","AO",44.4,null,null,4,"AO","Aosta","28,7"]
{"$rows_left_out":98}
{"sheet":"cashflow","index":24,"n_rows":39,"n_cols":23,"rows_kept":39,"cut":false,"hidden":true,"merged":[]}
[]
[]
[]
[]
[]
[]
[]
[]
{"$rows_left_out":31}