{"text_format":"1","workbook":"xlsx","n_sheets":25,"sheets":["bianco","Autenticazione","inizio","variabili","Dati","fabb_ACS","fabb_risc","UNI8477","riepilogo","grafico1","relazione","Dettaglio mesi","ammortamento","cti_show","relazione_amm","incentivi","cti","fc","Tabelle","Tabelle5","Tabelle6","CT20","tab_bollitore","Tab_UNI","cashflow"],"not_rendered":{"charts":4,"images":22,"macros":1,"external_links":1,"defined_names":119,"comments":4,"pivot_tables":0},"unopened":[],"bounds":{"document_bytes":16777216,"sheet_cells":100000,"rows_first":2000,"rows_last":500,"rows_between":2000,"halvings":0,"cell_chars":16384,"cell_head_chars":4096},"cells_cut":0,"cells_raw":0,"read":"whole","date_system":"1900"}

{"sheet":"bianco","index":0,"n_rows":0,"n_cols":0,"rows_kept":0,"cut":false,"hidden":false,"merged":[]}

{"sheet":"Autenticazione","index":1,"n_rows":47,"n_cols":12,"rows_kept":47,"cut":false,"hidden":false,"merged":[[16,6,16,7],[5,1,5,7],[11,3,11,4],[11,6,11,7],[12,3,12,4],[12,6,12,7],[8,3,8,7],[9,3,9,4],[6,6,6,7],[9,6,9,7],[10,3,10,7],[14,2,14,7],[13,3,13,7]]}
[]
[null,"Richiesta di licenza d'uso per il programma ParaSol FC",null,null,null,null,null,null,null,null,"Password aspettata"]
[null,null,null,null,null,null,null,null,null,null,{"$f":"100000+ROUND(+SQRT(codice_utente),0)","v":107816}]
[null,"Inviare via mail a marketing@paradigmaitalia.it",null,null,null,null,null,null,null,null,"Giusta?",{"$f":"IF(OR(passord_OK=password,password=\"0321Para\"),\"OK\",\"KO\")","v":"OK"}]
[]
[]
[null,"Riservato all'ufficio Paradigma.",null,"Il vostro codice di abilitazione è:",null,null,"0321Para"]
[]
[null,"Intestatario:","Ditta:*"]
[null,null,"Cognome:*",null,null,"Nome:*"]
[null,null,"Indirizzo:*"]
[null,null,"Città:*",null,null,"Provincia:*"]
[null,null,"Telefono:*",null,null,"Fax:"]
[null,null,"Email:"]
[null,null,"* i dati sono obbligatori"]
[null,"Agenzia Paradigma",null,"Partner Paradigma",null,null,"Altro"]
[null,null,null,null,null,null,null,null,null,true,1]
[null,null,null,null,null,null,null,null,null,false,2]
[null,"Numero di serie:",61092556,null,null,null,null,null,null,false,3]
[null,null,null,null,null,null,null,null,null,{"$f":"+IF(_age,1,IF(_pp,2,3))","v":1}]
[null,"Licenza d'uso:"]
[]
[]
[]
[]
[]
[]
[]
[]
[]
[]
[]
[]
[]
[]
[]
[]
[]
[]
[]
[]
[null,"Autorizzo il trattamento dei miei dati."]
[]
[]
[]
[null,"Data:",null,null,"Firma:"]
[null,{"$f":"+NOW()","v":"2021-01-26T14:21:16.450"}]

{"sheet":"inizio","index":2,"n_rows":20,"n_cols":6,"rows_kept":20,"cut":false,"hidden":false,"merged":[]}
[]
[]
[]
[]
[]
[]
[]
[null,null,"Dati generali impianto",null,null,"Energia solare mensile incidente sui collettori"]
[null,null,"Oggetto, committente, località, dati collettori (tipo, superficie, inclinazione)",null,null,"Energia raggiante ricevuta (per metro2) in accordo alle norme UNI 8477 parte I"]
[null,null,{"$f":"\"Fabbisogno acqua calda sanitaria\"","v":"Fabbisogno acqua calda sanitaria"},{"$f":"IF(ACS=TRUE,\"SI\",\"\")","v":"SI"},null,"Risultati del calcolo - copertura solare"]
[null,null,"Stima del fabbisogno energetico per l'aqua calda sanitaria.",null,null,"Riepilogo dei fabbisogni energetici, copertura solare"]
[null,null,{"$f":"\"Fabbisogno per riscaldamento\"","v":"Fabbisogno per riscaldamento"},{"$f":"IF(+INTEGRAZ=TRUE,\"SI\",\"\")","v":"SI"},null,"Relazione tecnica di riepilogo"]
[null,null,"Stima del fabbisogno per integrazione riscaldamento - Periodo riscaldamento - Gradi giorno - Potenza caldaia",null,null,"Relazione con i principali dati di input e di output"]
[null,null,null,null,null,"Bilancio economico impianto"]
[null,null,null,null,null,"Risparmio annuo sulla bolletta grazie all'impianto solare"]
[]
[]
[]
[]
[null," "]

{"sheet":"variabili","index":3,"n_rows":29,"n_cols":14,"rows_kept":29,"cut":false,"hidden":true,"merged":[]}
["Accetto condizioni",null,true]
["Fabbisogni scelti"]
[null,"ACS",true,null,{"$f":"+IF(ACS,\"ACS\",\"\")&IF(ACS,IF(INTEGRAZ,\" - \",\"\"),\"\")&IF(INTEGRAZ,\"RISC\",\"\")","v":"ACS - RISC"}]
[null,"INTEGRAZ",true]
[]
[null,null,null,null,null,null,null,null,null,null,null,null,"Fogli:"]
["Località scelta",null,6,null,null,null,null,null,"elenco valori in TabelleUNI, A5:C105",null,null,null,"tab_UNI","OK"]
[null,null,null,null,null,null,null,null,null,null,null,null,"tab_bollitore","OK"]
["Committente",null,"inserito direttamente nel foglio Dati, variabile \"committente\"",null,null,null,null,null,"testo libero"]
["Riferimento",null,"inserito direttamente nel foglio Dati, variabile \"riferimento\"",null,null,null,null,null,"testo libero"]
[]
["Pannello scelto",null,4,null,{"$f":"+superficie&\" m2 / \"&descrizpannelloscelto","v":"2,4 m2 / AQUA PLASMA"},null,null,null,"elenco valori in Tabelle"]
[]
["Superficie",null,"inserito direttamente nel foglio Dati, variabile \"superficie\"",null,null,null,null,null,"valore libero"]
["Inclinazione",null,"inserito direttamente nel foglio Dati, variabile \"inclinazione\"",null,null,null,null,null,"elenco valori in Tabelle"]
["Azimut",null,"inserito direttamente nel foglio Dati, variabile \"azimut\"",null,null,null,null,null,"elenco valori in Tabelle"]
[]
[]
["AQUAsys",null,true]
["Preriscaldo",null,false]
[]
["Bollitore scelto",null,3,null,null,null,null,null,"elenco valori in Bollitori"]
["Numero bollitori scelti",null,1,null,null,null,null,null,"libero inserimento"]
["Temperatura centrale termica",null,20,null,null,null,null,null,"libero inserimento"]
["Bollitore di altra marca",null,false,null,null,null,null,null,"vero/falso"]
["Volume di altra marca",null,1500,null,null,null,null,null,"libero inserimento"]
["K bollitore altra marca",null,4,"W/K",null,null,null,null,"libero inserimento"]
[]
["Scelta utilizzo ACS",null,3]

{"sheet":"Dati","index":4,"n_rows":18,"n_cols":18,"rows_kept":18,"cut":false,"hidden":false,"merged":[[4,2,4,19],[5,4,5,9],[7,4,7,9],[15,5,15,6],[18,4,18,7],[9,2,9,19],[14,2,14,19],[13,2,13,19],[17,3,17,6],[16,2,16,7]]}
[]
[]
[]
[]
[null,null,"Dati impianto"]
[null,null,"Committente:",null,"Nome committente",null,null,null,null,null,null,"Provincia:",null,{"$f":"VLOOKUP(localitascelta,Tab_UNI!AJ5:AL105,3,FALSE)","v":"Ascoli Piceno"},null,null,null,{"$f":"+\"Lat. = \"&VLOOKUP(localitascelta,Tab_UNI!Z5:AG105,5,FALSE)&\"°\"","v":"Lat. = 42°"}]
[]
[null,null,"Riferimento:",null,"Riferimento impianto"]
[]
[null,null,"Caratteristiche deI COLLETTORI"]
[null,null,"Tipo:",null,{"$f":"+descrizpannelloscelto","v":"AQUA PLASMA"},null,null,null,null,null,null,"Sup.apertura:",null,2.4,"m2"]
[]
[null,null,"Inclinazione:",null,45,"sull'orizzontale",null,null,null,null,null,"Azimut:",null,-5,"orientamento da sud"]
[null,null,{"$f":"+Tabelle!H25","v":""}]
[null,null,"Impianto solare"]
[null,null,"Accumulo solare:",null,null,{"$f":"+tab_bollitore!I58","v":543},null,"litri",null,null,null,"Tecnologia Aqua:",null,null,null,null,{"$f":"IF(aquasys=FALSE,\"NO\",\"SI\")","v":"SI"}]
[]
[null,null,null,{"$f":"+tab_bollitore!K58","v":"Aqua 500"},null,null,null,null,null,null,null,"Solare come preriscaldo:",null,null,null,null,{"$f":"IF(preriscaldo=FALSE,\"NO\",\"SI\")","v":"NO"}]

{"sheet":"fabb_ACS","index":5,"n_rows":24,"n_cols":15,"rows_kept":24,"cut":false,"hidden":false,"merged":[[19,6,19,7],[20,6,20,7],[11,2,11,13],[16,6,16,7],[17,6,17,7],[18,6,18,7]]}
[]
[]
[]
[]
[null,null,"Consumi:",{"$f":"IF(Tabelle5!H28=\"SI\",\"Altro utilizzo\",+Tabelle5!B28)","v":"abitazione S > 200 m2"},null,null,null,null,"Temperature:",null,"utilizzo:",40,null,"Valore UNI:\n40°C",45]
[null,null,null,{"$f":"IF(D5=\"altro utilizzo\",\"\",+Tabelle5!D28)","v":3.13},{"$f":"+Tabelle5!E28","v":"litri/G m2"},null,null,null,null,null,"ingresso:",{"$f":"+ROUND(Tabelle5!C39,0)","v":15},"Valore UNI non modificabile",null,12]
[null,null,null,{"$f":"IF(D5=\"altro utilizzo\",\"\",+Tabelle5!G28)","v":80},{"$f":"+Tabelle5!J28","v":"m2/alloggio (1 alloggi)"},null,null,null,null,null,null,null,null,null,8]
[null,null,null,{"$f":"+Tabelle5!H34","v":250},"litri / giorno (Vw)",null,null,null,"Profilo utilizzo:",null,"annuale",{"$f":"+Tabelle!B64","v":"sempre 100%"}]
[null,null,null,{"$f":"+Tabelle5!E40","v":7.2673611111111116},"kWh/giorno (inverno)"]
[null,null,null,null,null,null,null,null,"Ricircolo:"]
[]
[null,null,"Periodo d'utilizzo"]
[null,null,"gen","feb","mar","apr","mag","giu","lug","ago","sett","ott","nov","dic"]
[null,null,100,100,100,100,100,100,100,100,100,100,100,100]
[null,null,{"$f":"+Tabelle5!E44","v":225.28819444444446},{"$f":"+Tabelle5!E45","v":203.48611111111114},{"$f":"+Tabelle5!E46","v":225.28819444444446},{"$f":"+Tabelle5!E47","v":218.02083333333337},{"$f":"+Tabelle5!E48","v":225.28819444444446},{"$f":"+Tabelle5!E49","v":218.02083333333337},{"$f":"+Tabelle5!E50","v":225.28819444444446},{"$f":"+Tabelle5!E51","v":225.28819444444446},{"$f":"+Tabelle5!E52","v":218.02083333333337},{"$f":"+Tabelle5!E53","v":225.28819444444446},{"$f":"+Tabelle5!E54","v":218.02083333333337},{"$f":"+Tabelle5!E55","v":225.28819444444446}]
[]
[null,null,"Fabbisogno utile per ACS",null,null,"Qh,w:",{"$f":"SUM(C15:N15)","v":2652.5868055555557},null,"/anno"]
[null,null,"Fabbisogno per distribuzione",null,null,"Ql,w,d:",{"$f":"+cti!F31+cti!H31","v":470.99194444444475},null,"/anno"]
[null,null,"Fabbisogno erogazione",null,null,"Ql,w,er:",{"$f":"+cti!G31","v":0},null,"/anno"]
[null,null,"Fabbisogno stoccaggio",null,null,"Ql,w,s:",{"$f":"+cti!I31","v":574.65600000000006},null,"/anno"]
[null,null,"Totale fabbisogno sanitario",null,null,"Q,w,gn,out:",{"$f":"+G20+G19+G18+G17","v":3698.2347500000005},null,"/anno"]
[]
[]
[null,null,{"$f":"IF((D23+G23+J23+M23)>D8,\"Attenzione: il totale supera il consumo giornaliero. Ricontrollare le percentuali!\",\"\")","v":""}]

{"sheet":"fabb_risc","index":6,"n_rows":40,"n_cols":15,"rows_kept":40,"cut":false,"hidden":false,"merged":[[18,4,18,5]]}
[]
[]
[]
[]
[]
[null,null,"Inserire i fabbisogni per il riscaldamento / raffrescamento (kWh / mese):"]
[null,null,null,"gen","feb","mar","apr","mag","giu","lug","ago","set","ott","nov","dic"]
[]
[]
[]
[null,null,null,{"$f":"+D31*sup_risc","v":791.44204851752033},731.40161725067401,573.11320754716996,365.70080862533695,152.83018867924534,0,0,0,0,229.24528301886792,496.69811320754729,709.56873315363896]
[]
[]
[null,null,"Nel caso di fabbisogno stimato, inserire la superficie e il fabbisogno EPH:"]
[]
[null,null,"Superficie riscaldata",null,90,"m2",null,null,"Temp.min. progetto",null,{"$f":"VLOOKUP(localitascelta,Tab_UNI!Z5:AH105,9,FALSE)","v":-2}]
[null,null,"Fabbisogno EPH",null,45,"kWh/m2 anno",null,null,"Temp. media invern.",null,{"$f":"IF(K18<138,AVERAGE(D28,E28,N28,O28),IF(K18<184,AVERAGE(D28,E28,F28,O28,N28,M28),AVERAGE(D28,E28,F28,O28,N28,M28,G28)))","v":9.7999999999999989}]
[null,null,null,null,null,null,null,null,"Giorni riscald. / zona",null,{"$f":"VLOOKUP(localitascelta,Tab_UNI!BK5:BO105,4,FALSE)&\" / \"&VLOOKUP(localitascelta,Tab_UNI!BK5:BO105,3,FALSE)","v":"166 / D"}]
[null,null,null,null,null,null,null,null,"Gradi giorno",null,{"$f":"VLOOKUP(localitascelta,Tab_UNI!BK5:BO105,5,FALSE)","v":1698}]
[]
[]
[]
[]
[]
[]
[]
[null,null,null,"gen","feb","mar","apr","mag","giu","lug","ago","set","ott","nov","dic"]
[null,null,"T.media esterna",{"$f":"VLOOKUP(localitascelta,Tab_UNI!A5:P105,5,FALSE)","v":5.5},{"$f":"VLOOKUP(localitascelta,Tab_UNI!A5:P105,6,FALSE)","v":6.6},{"$f":"VLOOKUP(localitascelta,Tab_UNI!A5:P105,7,FALSE)","v":9.5},{"$f":"VLOOKUP(localitascelta,Tab_UNI!A5:P105,8,FALSE)","v":13.3},{"$f":"VLOOKUP(localitascelta,Tab_UNI!A5:P105,9,FALSE)","v":17.2},{"$f":"VLOOKUP(localitascelta,Tab_UNI!A5:P105,10,FALSE)","v":21.7},{"$f":"VLOOKUP(localitascelta,Tab_UNI!A5:P105,11,FALSE)","v":24.4},{"$f":"VLOOKUP(localitascelta,Tab_UNI!A5:P105,12,FALSE)","v":24.3},{"$f":"VLOOKUP(localitascelta,Tab_UNI!A5:P105,13,FALSE)","v":21.1},{"$f":"VLOOKUP(localitascelta,Tab_UNI!A5:P105,14,FALSE)","v":15.8},{"$f":"VLOOKUP(localitascelta,Tab_UNI!A5:P105,15,FALSE)","v":10.9},{"$f":"VLOOKUP(localitascelta,Tab_UNI!A5:P105,16,FALSE)","v":7}]
[null,null,"DT medio",{"$f":"20-D28","v":14.5},{"$f":"20-E28","v":13.4},10.5,6.6999999999999993,2.8000000000000007,-1.6999999999999993,-4.3999999999999986,-4.3000000000000007,-1.1000000000000014,4.1999999999999993,9.1,13]
[null,null,"DT medio",{"$f":"IF(D29<0,0,D29)","v":14.5},{"$f":"IF(E29<0,0,E29)","v":13.4},10.5,6.6999999999999993,2.8000000000000007,0,0,0,0,4.1999999999999993,9.1,13]
[null,null,"kWh/m2 mese",{"$f":"$E$17/SUM($D$30:$O$30)*D30","v":8.7938005390835592},8.1266846361186005,6.3679245283018879,4.0633423180592994,1.6981132075471705,0,0,0,0,2.5471698113207548,5.518867924528303,7.8840970350404334]
[null,null,"kWh / giorno",{"$f":"+D31*24","v":211.05121293800542},{"$f":"+E31*24","v":195.04043126684641},152.83018867924531,97.520215633423192,40.754716981132091,0,0,0,0,61.132075471698116,132.45283018867929,189.2183288409704]
[null,null,"gg",31,28,31,30,31,30,31,31,30,31,30,31]
[]
[null,null,"Usato da PARASOL",2,{"$f":"+INTEGRAZ","v":true}]
[null,null,null,{"$f":"IF(INTEGRAZ,IF($D$35=1,D8,D11),0)","v":791.44204851752033},731.40161725067401,573.11320754716996,365.70080862533695,152.83018867924534,0,0,0,0,229.24528301886792,496.69811320754729,709.56873315363896]
[]
[null,null,"Parasol web"]
[null,null,null,1,"Fabbisogno inserito dall'utente",null,null,{"$f":"+IF(fabb_risc_stimato_utente=1,TRUE,FALSE)","v":false}]
[null,null,null,2,"Fabbisogno stimato",null,null,{"$f":"+IF(fabb_risc_stimato_utente=2,TRUE,FALSE)","v":true}]

{"sheet":"UNI8477","index":7,"n_rows":28,"n_cols":17,"rows_kept":28,"cut":false,"hidden":false,"merged":[[4,15,6,15],[4,3,6,3],[2,5,2,15],[4,11,6,11],[4,12,6,12],[4,13,6,13],[4,14,6,14],[4,7,6,7],[4,10,6,10],[4,4,6,4],[4,8,6,8],[4,9,6,9],[4,5,6,5],[4,6,6,6],[26,2,26,3],[27,2,27,3],[24,4,24,5],[25,4,25,5],[26,4,26,5],[27,4,27,5],[24,2,24,3],[25,2,25,3]]}
[]
[]
[]
[]
[null,null,null,"Un.Mis","Gennaio","Febbraio","Marzo","Aprile","Maggio","Giugno","Luglio","Agosto","Settembre","Ottobre","Novembre","Dicembre"]
[]
[]
[null,null,"Hh","MJ/m2g",{"$f":"'Dettaglio mesi'!E6","v":5.4},{"$f":"'Dettaglio mesi'!F6","v":8.1999999999999993},{"$f":"'Dettaglio mesi'!G6","v":12.6},{"$f":"'Dettaglio mesi'!H6","v":17.2},{"$f":"'Dettaglio mesi'!I6","v":20.8},{"$f":"'Dettaglio mesi'!J6","v":23.7},{"$f":"'Dettaglio mesi'!K6","v":25.6},{"$f":"'Dettaglio mesi'!L6","v":22.3},{"$f":"'Dettaglio mesi'!M6","v":16.3},{"$f":"'Dettaglio mesi'!N6","v":10.4},{"$f":"'Dettaglio mesi'!O6","v":6.4},{"$f":"'Dettaglio mesi'!P6","v":4.8}]
[null,null,"r","-",{"$f":"'Dettaglio mesi'!E4","v":0.22},{"$f":"'Dettaglio mesi'!F4","v":0.22},{"$f":"'Dettaglio mesi'!G4","v":0.22},{"$f":"'Dettaglio mesi'!H4","v":0.22},{"$f":"'Dettaglio mesi'!I4","v":0.22},{"$f":"'Dettaglio mesi'!J4","v":0.22},{"$f":"'Dettaglio mesi'!K4","v":0.22},{"$f":"'Dettaglio mesi'!L4","v":0.22},{"$f":"'Dettaglio mesi'!M4","v":0.22},{"$f":"'Dettaglio mesi'!N4","v":0.22},{"$f":"'Dettaglio mesi'!O4","v":0.22},{"$f":"'Dettaglio mesi'!P4","v":0.22}]
[null,null,"d","°",{"$f":"'Dettaglio mesi'!E7","v":-20.916962574476418},{"$f":"'Dettaglio mesi'!F7","v":-12.954608093780696},{"$f":"'Dettaglio mesi'!G7","v":-2.4177348051423611},{"$f":"'Dettaglio mesi'!H7","v":9.4148933468800529},{"$f":"'Dettaglio mesi'!I7","v":18.791917517696167},{"$f":"'Dettaglio mesi'!J7","v":23.085911002836561},{"$f":"'Dettaglio mesi'!K7","v":21.183693564513842},{"$f":"'Dettaglio mesi'!L7","v":13.454959682356431},{"$f":"'Dettaglio mesi'!M7","v":2.2168867832133041},{"$f":"'Dettaglio mesi'!N7","v":-9.5993972342263003},{"$f":"'Dettaglio mesi'!O7","v":-18.911954741226136},{"$f":"'Dettaglio mesi'!P7","v":-23.049627643930577}]
[null,null,"ws","°",{"$f":"'Dettaglio mesi'!E9","v":69.870916178299879},{"$f":"'Dettaglio mesi'!F9","v":78.046168771922922},{"$f":"'Dettaglio mesi'!G9","v":87.821243733310467},{"$f":"'Dettaglio mesi'!H9","v":98.586443668273859},{"$f":"'Dettaglio mesi'!I9","v":107.84125604226485},{"$f":"'Dettaglio mesi'!J9","v":112.56884155765992},{"$f":"'Dettaglio mesi'!K9","v":110.42304082957587},{"$f":"'Dettaglio mesi'!L9","v":102.4401349611795},{"$f":"'Dettaglio mesi'!M9","v":91.997495126637688},{"$f":"'Dettaglio mesi'!N9","v":81.240793298933184},{"$f":"'Dettaglio mesi'!O9","v":72.031919368751176},{"$f":"'Dettaglio mesi'!P9","v":67.47294772986119}]
[null,null,"w'","°",{"$f":"'Dettaglio mesi'!E39","v":-69.870916178299879},{"$f":"'Dettaglio mesi'!F39","v":-78.046168771922922},{"$f":"'Dettaglio mesi'!G39","v":-87.821243733310467},{"$f":"'Dettaglio mesi'!H39","v":-93.058941849419512},{"$f":"'Dettaglio mesi'!I39","v":-92.555123849886144},{"$f":"'Dettaglio mesi'!J39","v":-92.306805058570191},{"$f":"'Dettaglio mesi'!K39","v":-92.42130472195015},{"$f":"'Dettaglio mesi'!L39","v":-92.849619405888077},{"$f":"'Dettaglio mesi'!M39","v":-92.000208447718521},{"$f":"'Dettaglio mesi'!N39","v":-81.243189368052001},{"$f":"'Dettaglio mesi'!O39","v":-72.034043836651591},{"$f":"'Dettaglio mesi'!P39","v":-67.474937738080541}]
[null,null,"w''","°",{"$f":"'Dettaglio mesi'!E40","v":69.872976910818124},{"$f":"'Dettaglio mesi'!F40","v":78.048470620627782},{"$f":"'Dettaglio mesi'!G40","v":86.586702864270265},{"$f":"'Dettaglio mesi'!H40","v":85.985922492346916},{"$f":"'Dettaglio mesi'!I40","v":85.48208963349596},{"$f":"'Dettaglio mesi'!J40","v":85.23376351840875},{"$f":"'Dettaglio mesi'!K40","v":85.345540738099047},{"$f":"'Dettaglio mesi'!L40","v":85.773855422036988},{"$f":"'Dettaglio mesi'!M40","v":86.352981661234139},{"$f":"'Dettaglio mesi'!N40","v":81.243189368052001},{"$f":"'Dettaglio mesi'!O40","v":72.034043836651591},{"$f":"'Dettaglio mesi'!P40","v":67.474937738080541}]
[null,null,"KT","-",{"$f":"'Dettaglio mesi'!E28","v":0.39028027249566738},{"$f":"'Dettaglio mesi'!F28","v":0.42734060877009933},{"$f":"'Dettaglio mesi'!G28","v":0.48027623481047299},{"$f":"'Dettaglio mesi'!H28","v":0.51009079916770894},{"$f":"'Dettaglio mesi'!I28","v":0.5317968039980363},{"$f":"'Dettaglio mesi'!J28","v":0.57315762942015991},{"$f":"'Dettaglio mesi'!K28","v":0.63709989901255093},{"$f":"'Dettaglio mesi'!L28","v":0.62353349417831971},{"$f":"'Dettaglio mesi'!M28","v":0.56393983230937805},{"$f":"'Dettaglio mesi'!N28","v":0.48989839575885058},{"$f":"'Dettaglio mesi'!O28","v":0.42456878531909803},{"$f":"'Dettaglio mesi'!P28","v":0.38726667024605332}]
[null,null,"R","-",{"$f":"'Dettaglio mesi'!E30","v":1.6718956511967404},{"$f":"'Dettaglio mesi'!F30","v":1.455574479579778},{"$f":"'Dettaglio mesi'!G30","v":1.2193129267809566},{"$f":"'Dettaglio mesi'!H30","v":1.0134645706578667},{"$f":"'Dettaglio mesi'!I30","v":0.88708048454856447},{"$f":"'Dettaglio mesi'!J30","v":0.83328286909196747},{"$f":"'Dettaglio mesi'!K30","v":0.85390755459235934},{"$f":"'Dettaglio mesi'!L30","v":0.96813304826798596},{"$f":"'Dettaglio mesi'!M30","v":1.1612575222904498},{"$f":"'Dettaglio mesi'!N30","v":1.4126601959160578},{"$f":"'Dettaglio mesi'!O30","v":1.662965355988834},{"$f":"'Dettaglio mesi'!P30","v":1.76762076496939}]
[null,null,"H","MJ/m2g",{"$f":"'Dettaglio mesi'!E31","v":9.0282365164623997},{"$f":"'Dettaglio mesi'!F31","v":11.935710732554179},{"$f":"'Dettaglio mesi'!G31","v":15.363342877440052},{"$f":"'Dettaglio mesi'!H31","v":17.431590615315304},{"$f":"'Dettaglio mesi'!I31","v":18.45127407861014},{"$f":"'Dettaglio mesi'!J31","v":19.74880399747963},{"$f":"'Dettaglio mesi'!K31","v":21.860033397564401},{"$f":"'Dettaglio mesi'!L31","v":21.589366976376088},{"$f":"'Dettaglio mesi'!M31","v":18.928497613334333},{"$f":"'Dettaglio mesi'!N31","v":14.691666037527002},{"$f":"'Dettaglio mesi'!O31","v":10.642978278328538},{"$f":"'Dettaglio mesi'!P31","v":8.484579671853071}]
[null,null,"Htot","MJ/m2",{"$f":"'Dettaglio mesi'!E33","v":279.87533201033438},{"$f":"'Dettaglio mesi'!F33","v":334.199900511517},{"$f":"'Dettaglio mesi'!G33","v":476.26362920064162},{"$f":"'Dettaglio mesi'!H33","v":522.94771845945911},{"$f":"'Dettaglio mesi'!I33","v":571.98949643691435},{"$f":"'Dettaglio mesi'!J33","v":592.46411992438891},{"$f":"'Dettaglio mesi'!K33","v":677.66103532449642},{"$f":"'Dettaglio mesi'!L33","v":669.27037626765866},{"$f":"'Dettaglio mesi'!M33","v":567.85492840002996},{"$f":"'Dettaglio mesi'!N33","v":455.44164716333705},{"$f":"'Dettaglio mesi'!O33","v":319.28934834985614},{"$f":"'Dettaglio mesi'!P33","v":263.02196982744522},{"$f":"SUM(E17:P17)","v":5730.2795018760789}]
[null,null,null,"kWh/m2",{"$f":"E17*1000000/3600000","v":77.743147780648442},{"$f":"F17*1000000/3600000","v":92.83330569764361},132.29545255573379,145.26325512762753,158.88597123247621,164.57336664566358,188.23917647902678,185.90843785212741,157.73748011111945,126.51156865648251,88.691485652737811,73.06165828540145,{"$f":"SUM(E18:P18)","v":1591.7443060766886}]
[]
[null,null,"Tm","°",{"$f":"'Dettaglio mesi'!E37","v":5.5},{"$f":"'Dettaglio mesi'!F37","v":6.6},{"$f":"'Dettaglio mesi'!G37","v":9.5},{"$f":"'Dettaglio mesi'!H37","v":13.3},{"$f":"'Dettaglio mesi'!I37","v":17.2},{"$f":"'Dettaglio mesi'!J37","v":21.7},{"$f":"'Dettaglio mesi'!K37","v":24.4},{"$f":"'Dettaglio mesi'!L37","v":24.3},{"$f":"'Dettaglio mesi'!M37","v":21.1},{"$f":"'Dettaglio mesi'!N37","v":15.8},{"$f":"'Dettaglio mesi'!O37","v":10.9},{"$f":"'Dettaglio mesi'!P37","v":7}]
[]
[null,null,"Il sole sorge:*",null,{"$f":"TRUNC('Dettaglio mesi'!E44)&\"h \"&(TRUNC(('Dettaglio mesi'!E44-TRUNC('Dettaglio mesi'!E44))*60)&\"m\")","v":"7h 20m"},{"$f":"TRUNC('Dettaglio mesi'!F44)&\"h \"&(TRUNC(('Dettaglio mesi'!F44-TRUNC('Dettaglio mesi'!F44))*60)&\"m\")","v":"6h 47m"},{"$f":"TRUNC('Dettaglio mesi'!G44)&\"h \"&(TRUNC(('Dettaglio mesi'!G44-TRUNC('Dettaglio mesi'!G44))*60)&\"m\")","v":"6h 8m"},{"$f":"TRUNC('Dettaglio mesi'!H44)&\"h \"&(TRUNC(('Dettaglio mesi'!H44-TRUNC('Dettaglio mesi'!H44))*60)&\"m\")","v":"5h 47m"},{"$f":"TRUNC('Dettaglio mesi'!I44)&\"h \"&(TRUNC(('Dettaglio mesi'!I44-TRUNC('Dettaglio mesi'!I44))*60)&\"m\")","v":"5h 49m"},{"$f":"TRUNC('Dettaglio mesi'!J44)&\"h \"&(TRUNC(('Dettaglio mesi'!J44-TRUNC('Dettaglio mesi'!J44))*60)&\"m\")","v":"5h 50m"},{"$f":"TRUNC('Dettaglio mesi'!K44)&\"h \"&(TRUNC(('Dettaglio mesi'!K44-TRUNC('Dettaglio mesi'!K44))*60)&\"m\")","v":"5h 50m"},{"$f":"TRUNC('Dettaglio mesi'!L44)&\"h \"&(TRUNC(('Dettaglio mesi'!L44-TRUNC('Dettaglio mesi'!L44))*60)&\"m\")","v":"5h 48m"},{"$f":"TRUNC('Dettaglio mesi'!M44)&\"h \"&(TRUNC(('Dettaglio mesi'!M44-TRUNC('Dettaglio mesi'!M44))*60)&\"m\")","v":"5h 51m"},{"$f":"TRUNC('Dettaglio mesi'!N44)&\"h \"&(TRUNC(('Dettaglio mesi'!N44-TRUNC('Dettaglio mesi'!N44))*60)&\"m\")","v":"6h 35m"},{"$f":"TRUNC('Dettaglio mesi'!O44)&\"h \"&(TRUNC(('Dettaglio mesi'!O44-TRUNC('Dettaglio mesi'!O44))*60)&\"m\")","v":"7h 11m"},{"$f":"TRUNC('Dettaglio mesi'!P44)&\"h \"&(TRUNC(('Dettaglio mesi'!P44-TRUNC('Dettaglio mesi'!P44))*60)&\"m\")","v":"7h 30m"}]
[null,null,"Il sole tramonta:*",null,{"$f":"TRUNC('Dettaglio mesi'!E45)&\"h \"&(TRUNC(('Dettaglio mesi'!E45-TRUNC('Dettaglio mesi'!E45))*60)&\"m\")","v":"16h 39m"},{"$f":"TRUNC('Dettaglio mesi'!F45)&\"h \"&(TRUNC(('Dettaglio mesi'!F45-TRUNC('Dettaglio mesi'!F45))*60)&\"m\")","v":"17h 12m"},{"$f":"TRUNC('Dettaglio mesi'!G45)&\"h \"&(TRUNC(('Dettaglio mesi'!G45-TRUNC('Dettaglio mesi'!G45))*60)&\"m\")","v":"17h 46m"},{"$f":"TRUNC('Dettaglio mesi'!H45)&\"h \"&(TRUNC(('Dettaglio mesi'!H45-TRUNC('Dettaglio mesi'!H45))*60)&\"m\")","v":"17h 43m"},{"$f":"TRUNC('Dettaglio mesi'!I45)&\"h \"&(TRUNC(('Dettaglio mesi'!I45-TRUNC('Dettaglio mesi'!I45))*60)&\"m\")","v":"17h 41m"},{"$f":"TRUNC('Dettaglio mesi'!J45)&\"h \"&(TRUNC(('Dettaglio mesi'!J45-TRUNC('Dettaglio mesi'!J45))*60)&\"m\")","v":"17h 40m"},{"$f":"TRUNC('Dettaglio mesi'!K45)&\"h \"&(TRUNC(('Dettaglio mesi'!K45-TRUNC('Dettaglio mesi'!K45))*60)&\"m\")","v":"17h 41m"},{"$f":"TRUNC('Dettaglio mesi'!L45)&\"h \"&(TRUNC(('Dettaglio mesi'!L45-TRUNC('Dettaglio mesi'!L45))*60)&\"m\")","v":"17h 43m"},{"$f":"TRUNC('Dettaglio mesi'!M45)&\"h \"&(TRUNC(('Dettaglio mesi'!M45-TRUNC('Dettaglio mesi'!M45))*60)&\"m\")","v":"17h 45m"},{"$f":"TRUNC('Dettaglio mesi'!N45)&\"h \"&(TRUNC(('Dettaglio mesi'!N45-TRUNC('Dettaglio mesi'!N45))*60)&\"m\")","v":"17h 24m"},{"$f":"TRUNC('Dettaglio mesi'!O45)&\"h \"&(TRUNC(('Dettaglio mesi'!O45-TRUNC('Dettaglio mesi'!O45))*60)&\"m\")","v":"16h 48m"},{"$f":"TRUNC('Dettaglio mesi'!P45)&\"h \"&(TRUNC(('Dettaglio mesi'!P45-TRUNC('Dettaglio mesi'!P45))*60)&\"m\")","v":"16h 29m"}]
[null,null,"* sul collettore"]
[null,null,"Località",null,"Inclinazione",null,null,"Hh","Radiazione media globale al suolo sul piano orizzontale secondo UNI 10349"]
[null,null,{"$f":"Dati!N6","v":"Ascoli Piceno"},null,{"$f":"Dati!E13","v":45},null,null,"H","Irraggiamento medio giornaliero sulla superficie considerata"]
[null,null,"Latitudine",null,"Azimut",null,null,"Htot","Irraggiamento mensile sulla superficie considerata in assenza di ostruzioni ai raggi solari"]
[null,null,{"$f":"Dati!R6","v":"Lat. = 42°"},null,{"$f":"Dati!N13","v":-5},null,null,"Tm","Temperatura media esterna giornaliera"]

{"sheet":"riepilogo","index":8,"n_rows":57,"n_cols":14,"rows_kept":57,"cut":false,"hidden":false,"merged":[[5,6,5,8],[6,11,6,12],[5,9,5,13],[56,2,56,13],[55,2,55,13],[54,2,54,13],[6,9,6,10]]}
[]
[]
[]
[]
[]
[null,null,null,null,"Radiazione","Energia fornita","Fabbisogno al generatore (*)",null,null,"Copertura"]
[null,null,null,null,"sui collett.","imp.solare","ACS","Riscald.","Totale","ACS",null,"RISCALDAMENTO",null,"Totale"]
[null,null,null,null,"kWh","kWh","kWh","kWh","kWh","kWh","%","kWh","%","%"]
[null,null,"gennaio",null,{"$f":"'UNI8477'!E18*superficie","v":186.58355467355625},{"$f":"+fc!AE35","v":99.024144453969399},{"$f":"+fc!S35","v":314.09665000000001},{"$f":"+fc!R35","v":720.2122641509435},{"$f":"SUM(G9:H9)","v":1034.3089141509436},{"$f":"+fc!AD35","v":29.483904726727626},{"$f":"IF(ISERROR(+fc!AH35),,+fc!AH35)","v":9.3868892669589518E-2},{"$f":"+fc!AC35","v":69.540239727241769},{"$f":"IF(ISERROR(+fc!AG35),,+fc!AG35)","v":9.6555200721585313E-2},{"$f":"IF(ISERROR(+fc!AF35),,+fc!AF35)","v":9.5739428616698694E-2}]
[null,null,"febbraio",null,{"$f":"'UNI8477'!F18*superficie","v":222.79993367434466},{"$f":"+fc!AE36","v":125.73895678990493},{"$f":"+fc!S36","v":283.70020000000005},{"$f":"+fc!R36","v":665.57547169811335},{"$f":"SUM(G10:H10)","v":949.27567169811346},{"$f":"+fc!AD36","v":37.132938665304884},{"$f":"IF(ISERROR(+fc!AH36),,+fc!AH36)","v":0.13088795378115659},{"$f":"+fc!AC36","v":88.606018124600041},{"$f":"IF(ISERROR(+fc!AG36),,+fc!AG36)","v":0.13312692833847292},{"$f":"IF(ISERROR(+fc!AF36),,+fc!AF36)","v":0.1324577891741148}]
[null,null,"marzo",null,{"$f":"'UNI8477'!G18*superficie","v":317.50908613376106},{"$f":"+fc!AE37","v":183.43526204522149},{"$f":"+fc!S37","v":314.09665000000001},{"$f":"+fc!R37","v":521.53301886792474},835.62966886792469,{"$f":"+fc!AD37","v":68.663569130781795},{"$f":"IF(ISERROR(+fc!AH37),,+fc!AH37)","v":0.21860649940323079},{"$f":"+fc!AC37","v":114.7716929144397},{"$f":"IF(ISERROR(+fc!AG37),,+fc!AG37)","v":0.22006601454222591},{"$f":"IF(ISERROR(+fc!AF37),,+fc!AF37)","v":0.2195174116947424}]
[null,null,"aprile",null,{"$f":"'UNI8477'!H18*superficie","v":348.63181230630607},{"$f":"+fc!AE38","v":200.33683118530854},{"$f":"+fc!S38","v":303.96450000000004},{"$f":"+fc!R38","v":332.78773584905662},636.75223584905666,{"$f":"+fc!AD38","v":95.69445617959542},{"$f":"IF(ISERROR(+fc!AH38),,+fc!AH38)","v":0.31482115898269503},{"$f":"+fc!AC38","v":104.64237500571312},{"$f":"IF(ISERROR(+fc!AG38),,+fc!AG38)","v":0.31444180098384406},{"$f":"IF(ISERROR(+fc!AF38),,+fc!AF38)","v":0.31462289397095855}]
[null,null,"maggio",null,{"$f":"'UNI8477'!I18*superficie","v":381.3263309579429},{"$f":"+fc!AE39","v":211.14656847621109},{"$f":"+fc!S39","v":314.09665000000001},{"$f":"+fc!R39","v":139.07547169811326},453.1721216981133,{"$f":"+fc!AD39","v":146.71505652075328},{"$f":"IF(ISERROR(+fc!AH39),,+fc!AH39)","v":0.46710162786121173},{"$f":"+fc!AC39","v":64.431511955457793},{"$f":"IF(ISERROR(+fc!AG39),,+fc!AG39)","v":0.46328451141490457},{"$f":"IF(ISERROR(+fc!AF39),,+fc!AF39)","v":0.46593018053495622}]
[null,null,"giugno",null,{"$f":"'UNI8477'!J18*superficie","v":394.97607994959259},{"$f":"+fc!AE40","v":205.66772587810195},{"$f":"+fc!S40","v":303.96450000000004},{"$f":"+fc!R40","v":0},303.96450000000004,{"$f":"+fc!AD40","v":205.66772587810195},{"$f":"IF(ISERROR(+fc!AH40),,+fc!AH40)","v":0.67661758487620072},{"$f":"+fc!AC40","v":0},{"$f":"IF(ISERROR(+fc!AG40),,+fc!AG40)","v":0},{"$f":"IF(ISERROR(+fc!AF40),,+fc!AF40)","v":0.67661758487620072}]
[null,null,"luglio",null,{"$f":"'UNI8477'!K18*superficie","v":451.77402354966426},{"$f":"+fc!AE41","v":233.05894809271419},{"$f":"+fc!S41","v":314.09665000000001},{"$f":"+fc!R41","v":0},314.09665000000001,{"$f":"+fc!AD41","v":233.05894809271419},{"$f":"IF(ISERROR(+fc!AH41),,+fc!AH41)","v":0.74199756060026167},{"$f":"+fc!AC41","v":0},{"$f":"IF(ISERROR(+fc!AG41),,+fc!AG41)","v":0},{"$f":"IF(ISERROR(+fc!AF41),,+fc!AF41)","v":0.74199756060026167}]
[null,null,"agosto",null,{"$f":"'UNI8477'!L18*superficie","v":446.18025084510577},{"$f":"+fc!AE42","v":230.6481488870127},{"$f":"+fc!S42","v":314.09665000000001},{"$f":"+fc!R42","v":0},314.09665000000001,{"$f":"+fc!AD42","v":230.6481488870127},{"$f":"IF(ISERROR(+fc!AH42),,+fc!AH42)","v":0.73432221861332392},{"$f":"+fc!AC42","v":0},{"$f":"IF(ISERROR(+fc!AG42),,+fc!AG42)","v":0},{"$f":"IF(ISERROR(+fc!AF42),,+fc!AF42)","v":0.73432221861332392}]
[null,null,"settembre",null,{"$f":"'UNI8477'!M18*superficie","v":378.5699522666867},{"$f":"+fc!AE43","v":197.9578426728805},{"$f":"+fc!S43","v":303.96450000000004},{"$f":"+fc!R43","v":0},303.96450000000004,{"$f":"+fc!AD43","v":197.9578426728805},{"$f":"IF(ISERROR(+fc!AH43),,+fc!AH43)","v":0.6512531650007829},{"$f":"+fc!AC43","v":0},{"$f":"IF(ISERROR(+fc!AG43),,+fc!AG43)","v":0},{"$f":"IF(ISERROR(+fc!AF43),,+fc!AF43)","v":0.6512531650007829}]
[null,null,"ottobre",null,{"$f":"'UNI8477'!N18*superficie","v":303.62776477555803},{"$f":"+fc!AE44","v":170.80175859156157},{"$f":"+fc!S44","v":314.09665000000001},{"$f":"+fc!R44","v":208.61320754716982},522.7098575471698,{"$f":"+fc!AD44","v":102.92349702250959},{"$f":"IF(ISERROR(+fc!AH44),,+fc!AH44)","v":0.32768097661184731},{"$f":"+fc!AC44","v":67.878261569051958},{"$f":"IF(ISERROR(+fc!AG44),,+fc!AG44)","v":0.32537854322432536},{"$f":"IF(ISERROR(+fc!AF44),,+fc!AF44)","v":0.32676207675335117}]
[null,null,"novembre",null,{"$f":"'UNI8477'!O18*superficie","v":212.85956556657075},{"$f":"+fc!AE45","v":117.75993361169674},{"$f":"+fc!S45","v":303.96450000000004},{"$f":"+fc!R45","v":451.99528301886807},755.95978301886817,{"$f":"+fc!AD45","v":47.192686731601093},{"$f":"IF(ISERROR(+fc!AH45),,+fc!AH45)","v":0.15525723145828241},{"$f":"+fc!AC45","v":70.567246880095652},{"$f":"IF(ISERROR(+fc!AG45),,+fc!AG45)","v":0.15612385688801514},{"$f":"IF(ISERROR(+fc!AF45),,+fc!AF45)","v":0.15577539474577781}]
[null,null,"dicembre",null,{"$f":"'UNI8477'!P18*superficie","v":175.34797988496348},{"$f":"+fc!AE46","v":91.861152328132931},{"$f":"+fc!S46","v":314.09665000000001},{"$f":"+fc!R46","v":645.70754716981151},959.80419716981146,{"$f":"+fc!AD46","v":29.578849835329798},{"$f":"IF(ISERROR(+fc!AH46),,+fc!AH46)","v":9.4171172584393364E-2},{"$f":"+fc!AC46","v":62.282302492803133},{"$f":"IF(ISERROR(+fc!AG46),,+fc!AG46)","v":9.6455899835446418E-2},{"$f":"IF(ISERROR(+fc!AF46),,+fc!AF46)","v":9.5708221113228339E-2}]
[null,null,"Totale",null,{"$f":"SUM(E9:E20)","v":3820.1863345840529},2067.4372730127161,3698.2347500000001,3685.5000000000009,7383.7347500000014,1424.7176243433128,{"$f":"IF(ISERROR(+fc!AH47),,+fc!AH47)","v":0.38524261455909814},{"$f":"SUM(L9:L20)","v":642.71964866940323},{"$f":"IF(ISERROR(+fc!AG47),,+fc!AG47)","v":0.17439143906373711},{"$f":"IF(ISERROR(+fc!AF47),,+fc!AF47)","v":0.27999885464638552}]
[]
[null,null,"Resa dell'impianto solare:",null,null,{"$f":"+pr_disp/superficie","v":861.43219708863171},"kWh/m2 anno",null,null,null,null,null,"% solare su E.prim. ACS:",{"$f":"+cti_show!K48","v":0.34340771731900172}]
[]
[]
[]
[]
[]
[]
[]
[]
[]
[]
[]
[]
[]
[]
[]
[]
[]
[]
[]
[]
[]
[]
[]
[]
[]
[]
[]
[]
[]
[]
[]
[null,null,"(*) per ACS: fabbisogno utile + dispersioni accumulo, distribuzione, erogazione - per RISC: fabbisogno termico al generatore"]
[null,null,"Non sono considerati i fenomeni di ombreggiamento e/o di ostruzione ai raggi solari dati da ostacoli presenti in sito o dal profilo orografico circostante."]
[null,null,"Paradigma s.r.l. non si assume alcuna responsabilità per i dati forniti da ParaSol, che sono puramente indicativi e soggetti a calcolo più dettagliato. "]

{"sheet":"grafico1","index":9,"n_rows":0,"n_cols":0,"rows_kept":0,"cut":false,"hidden":true,"merged":[]}

{"sheet":"relazione","index":10,"n_rows":133,"n_cols":13,"rows_kept":133,"cut":false,"hidden":false,"merged":[[121,10,123,12],[121,4,123,5],[121,6,123,6],[121,7,123,9],[105,7,108,9],[105,10,108,11],[112,6,115,9],[112,10,115,11],[89,2,91,13],[5,5,5,9],[6,5,6,9],[7,5,7,6],[70,5,70,7],[70,8,70,12]]}
[]
[]
[]
[null,null,null,"Simulazione impianto solare"]
[]
[null,null,null,"Committente:",null,{"$f":"+committente","v":"Nome committente"}]
[null,null,null,"Riferimento:",null,{"$f":"+riferimento","v":"Riferimento impianto"}]
[null,null,null,"Data:",null,{"$f":"+TODAY()","v":"2021-01-26"}]
[]
[null,null,null,"Dati generali"]
[null,null,null,"Località e dati climatici:",null,null,null,null,{"$f":"+Dati!N6","v":"Ascoli Piceno"}]
[null,null,null,"Tipologia collettori:",null,null,null,null,{"$f":"+Dati!E11","v":"AQUA PLASMA"}]
[null,null,null,"Superficie collettori:",null,null,null,null,{"$f":"+superficie","v":2.4},"m2"]
[null,null,null,"Inclinazione:",null,null,null,null,{"$f":"+Dati!E13","v":45},"°"]
[null,null,null,"Azimut:",null,null,null,null,{"$f":"+Dati!N13","v":-5},"°"]
[null,null,null,"Volume accumulo solare",null,null,null,null,{"$f":"+volume","v":543},"litri"]
[]
[null,null,null,"Fabbisogno acqua sanitaria",null,null,{"$f":"+ACS","v":true}]
[null,null,null,"Tipologia",null,null,null,null,{"$f":"IF(G18,+fabb_ACS!D5,\"-\")","v":"abitazione S > 200 m2"}]
[null,null,null,"Utenza",null,null,null,null,{"$f":"IF(G18,+fabb_ACS!D6&\" \"&fabb_ACS!E6,\"-\")","v":"3,13 litri/G m2"}]
[null,null,null,null,null,null,null,null,{"$f":"IF(G18,+fabb_ACS!D7,\"-\")","v":80},{"$f":"+fabb_ACS!E7","v":"m2/alloggio (1 alloggi)"}]
[null,null,null,"Consumo giornaliero",null,null,null,null,{"$f":"IF(G18,++fabb_ACS!D8,\"-\")","v":250},{"$f":"+fabb_ACS!E8","v":"litri / giorno (Vw)"}]
[null,null,null,"Ricircolo",null,null,null,null,{"$f":"IF(G18,IF(+Tabelle5!C36,\"Presente\",\"Assente\"),\"-\")","v":"Presente"}]
[null,null,null,"Temperatura ACS:",null,null,null,null,{"$f":"IF(G18,+fabb_ACS!L5,\"-\")","v":40},"°C"]
[null,null,null,"Temperature acqua fredda:",null,null,null,null,{"$f":"IF(G18,+fabb_ACS!L6& \"°C (estate) / \"&fabb_ACS!L7&\"°C (inverno)\",\"-\")","v":"15°C (estate) / °C (inverno)"}]
[null,null,null,"Fabbisogno energetico giornaliero",null,null,null,null,{"$f":"IF(G18,+fabb_ACS!D9,\"-\")","v":7.2673611111111116},"kWh/giorno"]
[null,null,null,"Fabbisogno annuo per ACS (comprese dispersioni ricircolo):",null,null,null,null,{"$f":"IF(G18,+fabb_ACS!G17+fabb_ACS!G18,\"-\")","v":3123.5787500000006},"kWh"]
[]
[null,null,null,"Fabbisogno per riscaldamento",null,null,null,{"$f":"+INTEGRAZ","v":true}]
[null,null,null,"Fabbisogno annuo per riscaldamento:",null,null,null,null,{"$f":"+riepilogo!H21","v":3685.5000000000009},"kWh"]
[]
[]
[]
[]
[]
[]
[]
[]
[]
[]
[]
[]
[]
[]
[]
[]
[]
[]
[]
[]
[]
[]
[]
[]
[]
[null,null,null,"Risultati solari:"]
[]
[null,null,null,"Potenza solare installata:",null,null,null,{"$f":"+superficie*0.7","v":1.68},"kW"]
[null,null,null,"Radiazione sui collettori solari:",null,null,null,{"$f":"+riepilogo!E21","v":3820.1863345840529},"kWh / anno"]
[null,null,null,"Energia fornita dai collettori:",null,null,null,{"$f":"+pr_disp","v":2067.4372730127161},"kWh / anno"]
[null,null,null,"      - di cui per ACS:",null,null,null,{"$f":"+riepilogo!J21","v":1424.7176243433128},"kWh / anno"]
[null,null,null,"      - di cui per riscaldamento:",null,null,null,{"$f":"+riepilogo!L21","v":642.71964866940323},"kWh / anno"]
[]
[]
[null,null,null,{"$f":"+riepilogo!C23","v":"Resa dell'impianto solare:"},null,null,null,{"$f":"+riepilogo!F23","v":861.43219708863171},"kWh/m2 anno"]
[null,null,null,{"$f":"\"Risparmio \"&Tabelle6!E10&\" all'anno:\"","v":"Risparmio metano all'anno:"},null,null,null,{"$f":"+comb_evitato","v":241},{"$f":"+unità_comb","v":"m3 di metano"}]
[null,null,null,"CO2 evitata:",null,null,null,{"$f":"+Tabelle6!G20","v":474.77},"kg/anno"]
[]
[]
[]
[null,null,null,null,"Energia","Fabbisogno (*)",null,null,"Copertura solare (*)"]
[null,null,null,null,"solare","Qw,gn,out","QH,gn,out","Qgn,out","Qw,sol,out","fw","QH,sol,out","fH","f"]
[null,null,null,null,"prodotta","ACS","Riscald.","Totale","ACS","ACS","Riscald.","Riscald.","Totale"]
[null,null,null,null,"kWh","kWh","kWh","kWh","kWh","%","kWh","%","%"]
[null,null,null,"gen",{"$f":"+riepilogo!F9","v":99.024144453969399},{"$f":"+riepilogo!G9","v":314.09665000000001},{"$f":"+riepilogo!H9","v":720.2122641509435},{"$f":"+riepilogo!I9","v":1034.3089141509436},{"$f":"+riepilogo!J9","v":29.483904726727626},{"$f":"+riepilogo!K9","v":9.3868892669589518E-2},{"$f":"+riepilogo!L9","v":69.540239727241769},{"$f":"+riepilogo!M9","v":9.6555200721585313E-2},{"$f":"+riepilogo!N9","v":9.5739428616698694E-2}]
[null,null,null,"feb",{"$f":"+riepilogo!F10","v":125.73895678990493},{"$f":"+riepilogo!G10","v":283.70020000000005},{"$f":"+riepilogo!H10","v":665.57547169811335},{"$f":"+riepilogo!I10","v":949.27567169811346},{"$f":"+riepilogo!J10","v":37.132938665304884},{"$f":"+riepilogo!K10","v":0.13088795378115659},{"$f":"+riepilogo!L10","v":88.606018124600041},{"$f":"+riepilogo!M10","v":0.13312692833847292},{"$f":"+riepilogo!N10","v":0.1324577891741148}]
[null,null,null,"mar",{"$f":"+riepilogo!F11","v":183.43526204522149},{"$f":"+riepilogo!G11","v":314.09665000000001},{"$f":"+riepilogo!H11","v":521.53301886792474},{"$f":"+riepilogo!I11","v":835.62966886792469},{"$f":"+riepilogo!J11","v":68.663569130781795},{"$f":"+riepilogo!K11","v":0.21860649940323079},{"$f":"+riepilogo!L11","v":114.7716929144397},{"$f":"+riepilogo!M11","v":0.22006601454222591},{"$f":"+riepilogo!N11","v":0.2195174116947424}]
[null,null,null,"apr",{"$f":"+riepilogo!F12","v":200.33683118530854},{"$f":"+riepilogo!G12","v":303.96450000000004},{"$f":"+riepilogo!H12","v":332.78773584905662},{"$f":"+riepilogo!I12","v":636.75223584905666},{"$f":"+riepilogo!J12","v":95.69445617959542},{"$f":"+riepilogo!K12","v":0.31482115898269503},{"$f":"+riepilogo!L12","v":104.64237500571312},{"$f":"+riepilogo!M12","v":0.31444180098384406},{"$f":"+riepilogo!N12","v":0.31462289397095855}]
[null,null,null,"mag",{"$f":"+riepilogo!F13","v":211.14656847621109},{"$f":"+riepilogo!G13","v":314.09665000000001},{"$f":"+riepilogo!H13","v":139.07547169811326},{"$f":"+riepilogo!I13","v":453.1721216981133},{"$f":"+riepilogo!J13","v":146.71505652075328},{"$f":"+riepilogo!K13","v":0.46710162786121173},{"$f":"+riepilogo!L13","v":64.431511955457793},{"$f":"+riepilogo!M13","v":0.46328451141490457},{"$f":"+riepilogo!N13","v":0.46593018053495622}]
[null,null,null,"giu",{"$f":"+riepilogo!F14","v":205.66772587810195},{"$f":"+riepilogo!G14","v":303.96450000000004},{"$f":"+riepilogo!H14","v":0},{"$f":"+riepilogo!I14","v":303.96450000000004},{"$f":"+riepilogo!J14","v":205.66772587810195},{"$f":"+riepilogo!K14","v":0.67661758487620072},{"$f":"+riepilogo!L14","v":0},{"$f":"+riepilogo!M14","v":0},{"$f":"+riepilogo!N14","v":0.67661758487620072}]
[null,null,null,"lug",{"$f":"+riepilogo!F15","v":233.05894809271419},{"$f":"+riepilogo!G15","v":314.09665000000001},{"$f":"+riepilogo!H15","v":0},{"$f":"+riepilogo!I15","v":314.09665000000001},{"$f":"+riepilogo!J15","v":233.05894809271419},{"$f":"+riepilogo!K15","v":0.74199756060026167},{"$f":"+riepilogo!L15","v":0},{"$f":"+riepilogo!M15","v":0},{"$f":"+riepilogo!N15","v":0.74199756060026167}]
[null,null,null,"ago",{"$f":"+riepilogo!F16","v":230.6481488870127},{"$f":"+riepilogo!G16","v":314.09665000000001},{"$f":"+riepilogo!H16","v":0},{"$f":"+riepilogo!I16","v":314.09665000000001},{"$f":"+riepilogo!J16","v":230.6481488870127},{"$f":"+riepilogo!K16","v":0.73432221861332392},{"$f":"+riepilogo!L16","v":0},{"$f":"+riepilogo!M16","v":0},{"$f":"+riepilogo!N16","v":0.73432221861332392}]
[null,null,null,"set",{"$f":"+riepilogo!F17","v":197.9578426728805},{"$f":"+riepilogo!G17","v":303.96450000000004},{"$f":"+riepilogo!H17","v":0},{"$f":"+riepilogo!I17","v":303.96450000000004},{"$f":"+riepilogo!J17","v":197.9578426728805},{"$f":"+riepilogo!K17","v":0.6512531650007829},{"$f":"+riepilogo!L17","v":0},{"$f":"+riepilogo!M17","v":0},{"$f":"+riepilogo!N17","v":0.6512531650007829}]
[null,null,null,"ott",{"$f":"+riepilogo!F18","v":170.80175859156157},{"$f":"+riepilogo!G18","v":314.09665000000001},{"$f":"+riepilogo!H18","v":208.61320754716982},{"$f":"+riepilogo!I18","v":522.7098575471698},{"$f":"+riepilogo!J18","v":102.92349702250959},{"$f":"+riepilogo!K18","v":0.32768097661184731},{"$f":"+riepilogo!L18","v":67.878261569051958},{"$f":"+riepilogo!M18","v":0.32537854322432536},{"$f":"+riepilogo!N18","v":0.32676207675335117}]
[null,null,null,"nov",{"$f":"+riepilogo!F19","v":117.75993361169674},{"$f":"+riepilogo!G19","v":303.96450000000004},{"$f":"+riepilogo!H19","v":451.99528301886807},{"$f":"+riepilogo!I19","v":755.95978301886817},{"$f":"+riepilogo!J19","v":47.192686731601093},{"$f":"+riepilogo!K19","v":0.15525723145828241},{"$f":"+riepilogo!L19","v":70.567246880095652},{"$f":"+riepilogo!M19","v":0.15612385688801514},{"$f":"+riepilogo!N19","v":0.15577539474577781}]
[null,null,null,"dic",{"$f":"+riepilogo!F20","v":91.861152328132931},{"$f":"+riepilogo!G20","v":314.09665000000001},{"$f":"+riepilogo!H20","v":645.70754716981151},{"$f":"+riepilogo!I20","v":959.80419716981146},{"$f":"+riepilogo!J20","v":29.578849835329798},{"$f":"+riepilogo!K20","v":9.4171172584393364E-2},{"$f":"+riepilogo!L20","v":62.282302492803133},{"$f":"+riepilogo!M20","v":9.6455899835446418E-2},{"$f":"+riepilogo!N20","v":9.5708221113228339E-2}]
[null,null,null,{"$f":"+riepilogo!C21","v":"Totale"},{"$f":"+riepilogo!F21","v":2067.4372730127161},{"$f":"+riepilogo!G21","v":3698.2347500000001},{"$f":"+riepilogo!H21","v":3685.5000000000009},{"$f":"+riepilogo!I21","v":7383.7347500000014},{"$f":"SUM(I75:I86)","v":1424.7176243433128},{"$f":"+riepilogo!K21","v":0.38524261455909814},{"$f":"SUM(K75:K86)","v":642.71964866940323},{"$f":"+riepilogo!M21","v":0.17439143906373711},{"$f":"+riepilogo!N21","v":0.27999885464638552}]
[]
[]
[null,null,"(*) per ACS: fabbisogno utile + dispersioni accumulo, distribuzione, erogazione - per RISC: fabbisogno termico al generatore\nNon sono considerati i fenomeni di ombreggiamento e/o di ostruzione ai raggi solari dati da ostacoli presenti in sito o dal profilo orografico circostante.\nParadigma non fornisce alcuna garanzia, né esplicita né implicita e non si assume alcuna responsabilità \nper i dati forniti dalla presente simulazione. Essi sono puramente indicativi e soggetti a calcolo più dettagliato. \nParadigma non garantisce l'uso del software in tutte le situazioni. "]
[]
[]
[]
[]
[]
[]
[]
[]
[]
[]
[]
[]
[]
[]
[]
[null,null,null,null,null,null,null,{"$f":"+Tabelle5!H34","v":250},null,null,"litri"]
[]
[]
[]
[]
[]
[]
[null,null,null,null,null,null,{"$f":"365*Tabelle5!H34","v":91250},null,null,null,"litri"]
[]
[]
[]
[]
[]
[]
[]
[]
[null,null,null,null,{"$f":"+J87","v":0.38524261455909814},null,"=",{"$f":"+E122*G113","v":35153.388578517704},null,null,"litri/anno"]
[]
[]
[]
[]
[]
[]
[]
[]
[]
[]
[null,null,null,null,{"$f":"+ROUND(H67/1000*20/0.2,0)","v":47}]

{"sheet":"Dettaglio mesi","index":11,"n_rows":52,"n_cols":16,"rows_kept":52,"cut":false,"hidden":true,"merged":[]}
[null,null,null,null,"GENNAIO","FEBBRAIO","MARZO","APRILE","MAGGIO","GIUGNO","LUGLIO","AGOSTO","SETTEMBRE","OTTOBRE","NOVEMBRE","DICEMBRE"]
["Componente diffusa della radiazione",null,"Hdh","MJ/m2",{"$f":"VLOOKUP(localitascelta,Tab_UNI!AJ5:BJ105,4,FALSE)","v":2.8},{"$f":"VLOOKUP(localitascelta,Tab_UNI!AJ5:BJ105,6,FALSE)","v":"3,8"},{"$f":"VLOOKUP(localitascelta,Tab_UNI!AJ5:BJ105,8,FALSE)","v":"5,3"},{"$f":"VLOOKUP(localitascelta,Tab_UNI!AJ5:BJ105,10,FALSE)","v":"6,8"},{"$f":"VLOOKUP(localitascelta,Tab_UNI!AJ5:BJ105,12,FALSE)","v":"7,8"},{"$f":"VLOOKUP(localitascelta,Tab_UNI!AJ5:BJ105,14,FALSE)","v":"8,0"},{"$f":"VLOOKUP(localitascelta,Tab_UNI!AJ5:BJ105,16,FALSE)","v":"7,1"},{"$f":"VLOOKUP(localitascelta,Tab_UNI!AJ5:BJ105,18,FALSE)","v":"6,3"},{"$f":"VLOOKUP(localitascelta,Tab_UNI!AJ5:BJ105,20,FALSE)","v":"5,5"},{"$f":"VLOOKUP(localitascelta,Tab_UNI!AJ5:BJ105,22,FALSE)","v":"4,2"},{"$f":"VLOOKUP(localitascelta,Tab_UNI!AJ5:BJ105,24,FALSE)","v":"3,0"},{"$f":"VLOOKUP(localitascelta,Tab_UNI!AJ5:BJ105,26,FALSE)","v":"2,5"}]
["Componente diretta della radiazione",null,"Hbh","MJ/m2",{"$f":"VLOOKUP(localitascelta,Tab_UNI!AJ5:BJ105,5,FALSE)","v":"2,6"},{"$f":"VLOOKUP(localitascelta,Tab_UNI!AJ5:BJ105,7,FALSE)","v":"4,4"},{"$f":"VLOOKUP(localitascelta,Tab_UNI!AJ5:BJ105,9,FALSE)","v":"7,3"},{"$f":"VLOOKUP(localitascelta,Tab_UNI!AJ5:BJ105,11,FALSE)","v":"10,4"},{"$f":"VLOOKUP(localitascelta,Tab_UNI!AJ5:BJ105,13,FALSE)","v":"13,0"},{"$f":"VLOOKUP(localitascelta,Tab_UNI!AJ5:BJ105,15,FALSE)","v":"15,7"},{"$f":"VLOOKUP(localitascelta,Tab_UNI!AJ5:BJ105,17,FALSE)","v":"18,5"},{"$f":"VLOOKUP(localitascelta,Tab_UNI!AJ5:BJ105,19,FALSE)","v":"16,0"},{"$f":"VLOOKUP(localitascelta,Tab_UNI!AJ5:BJ105,21,FALSE)","v":"10,8"},{"$f":"VLOOKUP(localitascelta,Tab_UNI!AJ5:BJ105,23,FALSE)","v":"6,2"},{"$f":"VLOOKUP(localitascelta,Tab_UNI!AJ5:BJ105,25,FALSE)","v":"3,4"},{"$f":"VLOOKUP(localitascelta,Tab_UNI!AJ5:BJ105,27,FALSE)","v":"2,3"}]
["Riflettanza ambiante circostante",null,"r",null,0.22,0.22,0.22,0.22,0.22,0.22,0.22,0.22,0.22,0.22,0.22,0.22]
["Ennesimo giorno dell'anno",null,"n",null,17,47,75,105,135,162,198,228,258,288,318,344]
["Radiazione media globale al suolo sul piano orizzontale  UNI",null,"Hh","MJ/m2",{"$f":"E3+E2","v":5.4},{"$f":"F3+F2","v":8.1999999999999993},{"$f":"G3+G2","v":12.6},{"$f":"H3+H2","v":17.2},{"$f":"I3+I2","v":20.8},23.7,25.6,22.3,16.3,10.4,6.4,4.8]
["Declinazione solare",null,"d","gradi °",{"$f":"23.45*SIN((360*(E5+284)/365)/180*PI())","v":-20.916962574476418},{"$f":"23.45*SIN((360*(F5+284)/365)/180*PI())","v":-12.954608093780696},{"$f":"23.45*SIN((360*(G5+284)/365)/180*PI())","v":-2.4177348051423611},{"$f":"23.45*SIN((360*(H5+284)/365)/180*PI())","v":9.4148933468800529},{"$f":"23.45*SIN((360*(I5+284)/365)/180*PI())","v":18.791917517696167},23.085911002836561,21.183693564513842,13.454959682356431,2.2168867832133041,-9.5993972342263003,-18.911954741226136,-23.049627643930577]
[null,null,null,"rad",{"$f":"E7/180*PI()","v":-0.36506986644104311},-0.22610056454197949,-4.2197432789797727E-2,0.16432088762716554,0.32798083344699785,0.40292515782188393,0.36972520043430035,0.23483334718021009,3.869197351101792E-2,-0.16754108794408623,-0.33007587822254825,-0.40229189374529173]
["Angolo orario al tramonto",null,"ws","gradi °",{"$f":"E10/PI()*180","v":69.870916178299879},78.046168771922922,87.821243733310467,98.586443668273859,107.84125604226485,112.56884155765992,110.42304082957587,102.4401349611795,91.997495126637688,81.240793298933184,72.031919368751176,67.47294772986119]
[null,null,null,"rad",{"$f":"ACOS(-TAN(lat)*TAN(E8))","v":1.2194775386963064},1.3621626136372342,1.5327698563427046,1.7206580398432949,1.8821849874237506,1.9646969203369877,1.9272456325402296,1.7879176412599358,1.6056591935472653,1.4179193299985298,1.2571941595157834,1.1776250939121111]
["Funzioni intermedie",null,"Th",null,{"$f":"SIN(E8)*SIN(lat)","v":-0.23888936734450361},{"$f":"SIN(F8)*SIN(lat)","v":-0.15000506407914621},{"$f":"SIN(G8)*SIN(lat)","v":-2.8227215042570218E-2},{"$f":"SIN(H8)*SIN(lat)","v":0.1094579933494598},{"$f":"SIN(I8)*SIN(lat)","v":0.2155484822410566},0.26237341846262752,0.2417965107566275,0.15569391841148955,2.5883524332307607E-2,-0.11158313176594574,-0.21687514033111138,-0.26198356318393418]
[null,null,"Uh",null,{"$f":"COS(E8)*COS(lat)","v":0.69417070464778252},{"$f":"COS(F8)*COS(lat)","v":0.72423028391741051},{"$f":"COS(G8)*COS(lat)","v":0.74248329313938244},{"$f":"COS(H8)*COS(lat)","v":0.73313442216263613},{"$f":"COS(I8)*COS(lat)","v":0.70353127608812183},0.68363226066732241,0.69292806398885243,0.72274782737497689,0.74258862540041803,0.73273915665891587,0.70302819794870319,0.68381665369231315]
[null,null,"T",null,{"$f":"SIN(E8)*(SIN(lat)*COS(beta)-COS(lat)*SIN(beta)*COS(gamma))","v":1.7970804633929215E-2},{"$f":"SIN(F8)*(SIN(lat)*COS(beta)-COS(lat)*SIN(beta)*COS(gamma))","v":1.1284351960206204E-2},{"$f":"SIN(G8)*(SIN(lat)*COS(beta)-COS(lat)*SIN(beta)*COS(gamma))","v":2.1234338410650428E-3},{"$f":"SIN(H8)*(SIN(lat)*COS(beta)-COS(lat)*SIN(beta)*COS(gamma))","v":-8.2341388232167519E-3},{"$f":"SIN(I8)*(SIN(lat)*COS(beta)-COS(lat)*SIN(beta)*COS(gamma))","v":-1.6214952161968263E-2},-1.9737426980282552E-2,-1.8189498780440776E-2,-1.1712304409215762E-2,-1.9471262542324083E-3,8.3940054917388887E-3,1.6314751971467589E-2,1.9708099542536862E-2]
[null,null,"U",null,{"$f":"COS(E8)*(COS(lat)*COS(beta)+SIN(lat)*SIN(beta)*COS(gamma))","v":0.9311368566179864},{"$f":"COS(F8)*(COS(lat)*COS(beta)+SIN(lat)*SIN(beta)*COS(gamma))","v":0.97145774882069369},{"$f":"COS(G8)*(COS(lat)*COS(beta)+SIN(lat)*SIN(beta)*COS(gamma))","v":0.99594171150734978},{"$f":"COS(H8)*(COS(lat)*COS(beta)+SIN(lat)*SIN(beta)*COS(gamma))","v":0.98340145552142266},{"$f":"COS(I8)*(COS(lat)*COS(beta)+SIN(lat)*SIN(beta)*COS(gamma))","v":0.94369280720585813},0.91700094806421184,0.92947002091127218,0.96946923228470017,0.99608300060207022,0.98287125988481716,0.94301799538473829,0.91724828656542279]
[null,null,"V",null,{"$f":"COS(E8)*SIN(beta)*SIN(gamma)","v":-5.7567031339743224E-2},{"$f":"COS(F8)*SIN(beta)*SIN(gamma)","v":-6.0059848639995299E-2},{"$f":"COS(G8)*SIN(beta)*SIN(gamma)","v":-6.1573556358990783E-2},{"$f":"COS(H8)*SIN(beta)*SIN(gamma)","v":-6.079826183142549E-2},{"$f":"COS(I8)*SIN(beta)*SIN(gamma)","v":-5.834329617756482E-2},-5.6693086457262051E-2,-5.7463980125859217E-2,-5.9936909683242022E-2,-6.1582291480671264E-2,-6.0765482773640661E-2,-5.8301576302576805E-2,-5.6708378026003571E-2]
[null,null,"U2+V2-T2",null,{"$f":"E14^2+E15^2-E13^2","v":0.87000685903050456},0.94721000656326726,0.99568668659160564,0.97070705032121529,0.89369712990732109,0.84371527877891195,0.86688577091882235,0.94332584741448888,0.99596993141178436,0.96965789807608604,0.89241584228692494,0.84417185015796548]
[null,null,"a)      w","rad",{"$f":"2*ATAN((-E15-SQRT(E16))/(E13-E14))","v":1.5283147241265009},1.520644478035851,1.5111784836005837,1.5006931972761548,1.4918999143534863,1.4875659338504506,1.4895167568263232,1.4969920378240511,1.5070993993820392,1.5175745767323201,1.5263189209421892,1.5304972693666647]
[null,null,"b)      w","rad",{"$f":"2*ATAN((-E15+SQRT(E16))/(E13-E14))","v":-1.6518064605446576},{"$f":"2*ATAN((-F15+SQRT(F16))/(F13-F14))","v":-1.6441362144540077},{"$f":"2*ATAN((-G15+SQRT(G16))/(G13-G14))","v":-1.6346702200187402},{"$f":"2*ATAN((-H15+SQRT(H16))/(H13-H14))","v":-1.6241849336943115},{"$f":"2*ATAN((-I15+SQRT(I16))/(I13-I14))","v":-1.615391650771643},-1.611057670268607,-1.6130084932444799,-1.6204837742422078,-1.6305911358001959,-1.6410663131504766,-1.6498106573603457,-1.6539890057848214]
[null,null,"w1","rad",{"$f":"IF((E15*COS(E17))>(E14*SIN(E17)),E17,E18)","v":-1.6518064605446576},-1.6441362144540077,-1.6346702200187402,-1.6241849336943115,-1.615391650771643,-1.611057670268607,-1.6130084932444799,-1.6204837742422078,-1.6305911358001959,-1.6410663131504766,-1.6498106573603457,-1.6539890057848214]
[null,null,"w2","rad",{"$f":"IF((E15*COS(E17))>(E14*SIN(E17)),E18,E17)","v":1.5283147241265009},{"$f":"IF((F15*COS(F17))>(F14*SIN(F17)),F18,F17)","v":1.520644478035851},{"$f":"IF((G15*COS(G17))>(G14*SIN(G17)),G18,G17)","v":1.5111784836005837},{"$f":"IF((H15*COS(H17))>(H14*SIN(H17)),H18,H17)","v":1.5006931972761548},{"$f":"IF((I15*COS(I17))>(I14*SIN(I17)),I18,I17)","v":1.4918999143534863},1.4875659338504506,1.4895167568263232,1.4969920378240511,1.5070993993820392,1.5175745767323201,1.5263189209421892,1.5304972693666647]
["Angolo all'apparire del sole sulla superficie",null,"w'","rad",{"$f":"IF(E16>0,SIGN(E19)*MIN(ABS(E19),ABS(E10)),IF((E13+E14)>0,-E10,0))","v":-1.2194775386963064},{"$f":"IF(F16>0,SIGN(F19)*MIN(ABS(F19),ABS(F10)),IF((F13+F14)>0,-F10,0))","v":-1.3621626136372342},{"$f":"IF(G16>0,SIGN(G19)*MIN(ABS(G19),ABS(G10)),IF((G13+G14)>0,-G10,0))","v":-1.5327698563427046},{"$f":"IF(H16>0,SIGN(H19)*MIN(ABS(H19),ABS(H10)),IF((H13+H14)>0,-H10,0))","v":-1.6241849336943115},{"$f":"IF(I16>0,SIGN(I19)*MIN(ABS(I19),ABS(I10)),IF((I13+I14)>0,-I10,0))","v":-1.615391650771643},-1.611057670268607,-1.6130084932444799,-1.6204837742422078,-1.6056591935472653,-1.4179193299985298,-1.2571941595157834,-1.1776250939121111]
["Angolo allo scomparire del sole sulla superficie",null,"w''","rad",{"$f":"IF(E16>0,SIGN(E20)*MIN(ABS(E20),ABS(E10)),IF((E13+E14)>0,E10,0))","v":1.2194775386963064},{"$f":"IF(F16>0,SIGN(F20)*MIN(ABS(F20),ABS(F10)),IF((F13+F14)>0,F10,0))","v":1.3621626136372342},{"$f":"IF(G16>0,SIGN(G20)*MIN(ABS(G20),ABS(G10)),IF((G13+G14)>0,G10,0))","v":1.5111784836005837},{"$f":"IF(H16>0,SIGN(H20)*MIN(ABS(H20),ABS(H10)),IF((H13+H14)>0,H10,0))","v":1.5006931972761548},{"$f":"IF(I16>0,SIGN(I20)*MIN(ABS(I20),ABS(I10)),IF((I13+I14)>0,I10,0))","v":1.4918999143534863},1.4875659338504506,1.4895167568263232,1.4969920378240511,1.5070993993820392,1.4179193299985298,1.2571941595157834,1.1776250939121111]
[null,null,null,null,{"$f":"E2/E6","v":0.51851851851851849},{"$f":"F2/F6","v":0.46341463414634149},{"$f":"G2/G6","v":0.42063492063492064},{"$f":"H2/H6","v":0.39534883720930231},{"$f":"I2/I6","v":0.375},0.33755274261603374,0.27734374999999994,0.28251121076233182,0.33742331288343558,0.40384615384615385,0.46875,0.52083333333333337]
["Irraggiamento extratmosferico",null,"Hho","MJ/m2",{"$f":"24*3600/1000000/PI()*Ics*(1+0.033*COS(360*E5/365/180*PI()))*(E11*2*PI()*E9/360+E12*SIN(E10))","v":13.836210489117017},{"$f":"24*3600/1000000/PI()*Ics*(1+0.033*COS(360*F5/365/180*PI()))*(F11*2*PI()*F9/360+F12*SIN(F10))","v":19.188440863600292},{"$f":"24*3600/1000000/PI()*Ics*(1+0.033*COS(360*G5/365/180*PI()))*(G11*2*PI()*G9/360+G12*SIN(G10))","v":26.234902097481925},{"$f":"24*3600/1000000/PI()*Ics*(1+0.033*COS(360*H5/365/180*PI()))*(H11*2*PI()*H9/360+H12*SIN(H10))","v":33.719486860112802},{"$f":"24*3600/1000000/PI()*Ics*(1+0.033*COS(360*I5/365/180*PI()))*(I11*2*PI()*I9/360+I12*SIN(I10))","v":39.112683347523102},41.349881399949815,40.182081396775857,35.763916787479886,28.903792685205826,21.22889172537592,15.074118072975805,12.394560050701696]
["Irraggiamento diretto sull'orizzontale extratm.",null,"Hbh","W/m2",{"$f":"2*Ics*(E11*E10+E12*SIN(E10))","v":975.37857325652317},1364.3487694476951,1890.6300105499918,2471.2735304840562,2910.032105424531,3103.1415211891158,3018.1995560267642,2663.1011925086618,2120.6854663139648,1531.534789156701,1071.8095643918291,874.36858308640558]
["Irraggiamento diretto sulla superficie extratmos.",null,"Hb","W/m2",{"$f":"Ics*(E13*(E22-E21)+E14*(SIN(E22)-SIN(E21))-E15*(COS(E22)-COS(E21)))","v":2425.0569053295344},2613.3536845920621,2702.1919829031581,2631.2584535587166,2489.9617960621035,2402.8206393080468,2443.1129579340986,2578.7996506786667,2691.8560496740506,2660.8371509719364,2482.8535643394871,2355.4913973863481]
["Rapporto di irraggiamento diretto",null,"Rb",null,{"$f":"E26/E25","v":2.4862724810869388},1.9154586738477284,1.4292547816466108,1.0647378451236531,0.85564753441057129,0.77431874212017637,0.80946037946883653,0.96834459686806629,1.2693330021980378,1.7373664443084937,2.3165062589717782,2.6939341634071239]
["Indice di soleggiamento",null,"KT",null,{"$f":"E6/E24","v":0.39028027249566738},{"$f":"F6/F24","v":0.42734060877009933},{"$f":"G6/G24","v":0.48027623481047299},{"$f":"H6/H24","v":0.51009079916770894},{"$f":"I6/I24","v":0.5317968039980363},0.57315762942015991,0.63709989901255093,0.62353349417831971,0.56393983230937805,0.48989839575885058,0.42456878531909803,0.38726667024605332]
["Frazione diffusa del soleggiamento",null,"Hd/Hh",null,{"$f":"E2/E6","v":0.51851851851851849},{"$f":"F2/F6","v":0.46341463414634149},{"$f":"G2/G6","v":0.42063492063492064},{"$f":"H2/H6","v":0.39534883720930231},{"$f":"I2/I6","v":0.375},0.33755274261603374,0.27734374999999994,0.28251121076233182,0.33742331288343558,0.40384615384615385,0.46875,0.52083333333333337]
["Rapporto di irraggiamento globale",null,"R",null,{"$f":"(1-E29)*E27+E29*(1+COS(beta))/2+E4*(1-COS(beta))/2","v":1.6718956511967404},1.455574479579778,1.2193129267809566,1.0134645706578667,0.88708048454856447,0.83328286909196747,0.85390755459235934,0.96813304826798596,1.1612575222904498,1.4126601959160578,1.662965355988834,1.76762076496939]
["Irraggiamento medio mensile giornaliero",null,"H","MJ/m2",{"$f":"E30*E6","v":9.0282365164623997},11.935710732554179,15.363342877440052,17.431590615315304,18.45127407861014,19.74880399747963,21.860033397564401,21.589366976376088,18.928497613334333,14.691666037527002,10.642978278328538,8.484579671853071]
["Giorni al mese",null,null,null,31,28,31,30,31,30,31,31,30,31,30,31]
["Radiazione totale mensile",null,null,"MJ/m2",{"$f":"E32*E31","v":279.87533201033438},{"$f":"F32*F31","v":334.199900511517},476.26362920064162,522.94771845945911,571.98949643691435,592.46411992438891,677.66103532449642,669.27037626765866,567.85492840002996,455.44164716333705,319.28934834985614,263.02196982744522]
[null,null,null,"kWh/m2",{"$f":"E33/3.6","v":77.743147780648442},{"$f":"F33/3.6","v":92.83330569764361},132.29545255573379,145.26325512762753,158.88597123247621,164.57336664566358,188.23917647902678,185.90843785212741,157.73748011111942,126.51156865648251,88.691485652737811,73.06165828540145]
["Totale annuo",null,null,"MJ/m2",{"$f":"SUM(E33:P33)","v":5730.2795018760789}]
[null,null,null,"kWh/m2",{"$f":"E35/3.6","v":1591.7443060766886}]
["Temperature medie",null,null,"°",{"$f":"VLOOKUP(localitascelta,Tab_UNI!A5:P105,5)","v":5.5},{"$f":"VLOOKUP(localitascelta,Tab_UNI!A5:P105,6)","v":6.6},{"$f":"VLOOKUP(localitascelta,Tab_UNI!A5:P105,7)","v":9.5},{"$f":"VLOOKUP(localitascelta,Tab_UNI!A5:P105,8)","v":13.3},{"$f":"VLOOKUP(localitascelta,Tab_UNI!A5:P105,9)","v":17.2},{"$f":"VLOOKUP(localitascelta,Tab_UNI!A5:P105,10)","v":21.7},{"$f":"VLOOKUP(localitascelta,Tab_UNI!A5:P105,11)","v":24.4},{"$f":"VLOOKUP(localitascelta,Tab_UNI!A5:P105,12)","v":24.3},{"$f":"VLOOKUP(localitascelta,Tab_UNI!A5:P105,13)","v":21.1},{"$f":"VLOOKUP(localitascelta,Tab_UNI!A5:P105,14)","v":15.8},{"$f":"VLOOKUP(localitascelta,Tab_UNI!A5:P105,15)","v":10.9},{"$f":"VLOOKUP(localitascelta,Tab_UNI!A5:P105,16)","v":7}]
[]
["Angolo all'apparire del sole sulla superficie",null,"w'",null,{"$f":"E21/PI()*180","v":-69.870916178299879},-78.046168771922922,-87.821243733310467,-93.058941849419512,-92.555123849886144,-92.306805058570191,{"$f":"K21/3.1415*180","v":-92.42130472195015},-92.849619405888077,-92.000208447718521,-81.243189368052001,-72.034043836651591,-67.474937738080541]
["Angolo allo scomparire del sole sulla superficie",null,"w''",null,{"$f":"E22/3.1415*180","v":69.872976910818124},{"$f":"F22/3.1415*180","v":78.048470620627782},86.586702864270265,85.985922492346916,85.48208963349596,85.23376351840875,85.345540738099047,85.773855422036988,86.352981661234139,81.243189368052001,72.034043836651591,67.474937738080541]
["Irraggiamento diretto sulla superficie",null,"KT  Hb","W/m2",{"$f":"E46","v":269.18995399632234},{"$f":"F46","v":318.60240842250505},367.03561910342552,405.66160794856552,431.82156784346415,463.48101722538718,512.37604095484437,503.60511585365919,{"$f":"M46","v":442.20537915458789},376.74096519673765,307.81100480024259,261.96700941478667]
["Angoli app/scomp rispetto perpen. coll.",null,"a",null,{"$f":"IF(E39-(gamma/PI()*180)<-90,-90,E39-(gamma/PI()*180))","v":-64.870916178299879},{"$f":"IF(F39-(gamma/PI()*180)<-90,-90,F39-(gamma/PI()*180))","v":-73.046168771922922},-82.821243733310467,-88.058941849419512,-87.555123849886144,-87.306805058570191,-87.42130472195015,-87.849619405888077,-87.000208447718521,-76.243189368052001,-67.034043836651591,-62.474937738080541]
[null,null,"b",null,{"$f":"IF((E40-gamma/PI()*180)>90,90,(E40-gamma/PI()*180))","v":74.872976910818124},{"$f":"IF((F40-gamma/PI()*180)>90,90,(F40-gamma/PI()*180))","v":83.048470620627782},90,90,90,90,90,90,90,{"$f":"IF((N40-gamma/PI()*180)>90,90,(N40-gamma/PI()*180))","v":86.243189368052001},77.034043836651591,72.474937738080541]
["Ora alba",null,null,null,{"$f":"E39/15+12","v":7.3419389214466744},6.7969220818718048,6.1452504177793026,5.796070543372033,5.8296584100075908,5.8462129960953204,5.8385796852033236,{"$f":"L39/15+12","v":5.8100253729407951},5.8666527701520987,6.5837873754632001,7.1977304108898936,7.5016708174612976]
["Ora tramonto",null,null,null,{"$f":"E40/15+12","v":16.658198460721209},{"$f":"F40/15+12","v":17.203231374708519},17.772446857618018,17.732394832823129,17.698805975566398,17.682250901227249,17.68970271587327,17.718257028135799,17.756865444082276,17.416212624536801,16.802269589110107,16.498329182538704]
["Irraggiamento (energia/ore)",null,null,"W/m2 g",{"$f":"E31/3.6*1000/E47","v":269.18995399632234},318.60240842250505,367.03561910342552,405.66160794856552,431.82156784346415,463.48101722538718,512.37604095484437,503.60511585365919,442.20537915458789,376.74096519673765,307.81100480024259,261.96700941478667]
["ore di irraggiamento",null,null,null,{"$f":"12-E44+E45-12","v":9.3162595392745331},10.406309292836713,11.627196439838716,11.936324289451097,11.869147565558805,11.836037905131928,11.851123030669946,11.908231655195003,11.890212673930179,10.832425249073601,9.6045391782202145,8.9966583650774083]
[]
[]
[null,null,null,"diretta",{"$f":"(1-E29)*E27*E28*E24","v":6.4643084508260422},{"$f":"(1-F29)*F27*F28*F24","v":8.4280181649300037},10.433559906020257,11.073273589285991,11.123417947337428,12.156804251286768,14.975017020173476,{"$f":"(1-L29)*L27*L28*L24","v":15.493513549889062},{"$f":"(1-M29)*M27*M28*M24","v":13.708796423738809},{"$f":"(1-N29)*N27*N28*N24","v":10.771671954712664},{"$f":"(1-O29)*O27*O28*O24","v":7.8761212805040461},{"$f":"(1-P29)*P27*P28*P24","v":6.1960485758363832}]
[null,null,null,"diffusa",{"$f":"E29*(1+COS(beta))/2*E28*E24","v":2.3899494936611667},{"$f":"F29*(1+COS(beta))/2*F28*F24","v":3.2435028842544398},4.5238329701443503,5.8041630560342616,6.6577164466275356,6.828427124746189,6.0602290732122421,{"$f":"L29*(1+COS(beta))/2*L28*L24","v":5.3773863607376242},{"$f":"M29*(1+COS(beta))/2*M28*M24","v":4.6945436482630063},{"$f":"N29*(1+COS(beta))/2*N28*N24","v":3.5849242404917501},{"$f":"O29*(1+COS(beta))/2*O28*O24","v":2.5606601717798219},{"$f":"P29*(1+COS(beta))/2*P28*P24","v":2.1338834764831844}]
[null,null,null,"riflessa",{"$f":"E4*(1-COS(beta))/2*E28*E24","v":0.17397857197519073},{"$f":"F4*(1-COS(beta))/2*F28*F24","v":0.26418968336973403},0.405950001275445,0.55415396999505195,0.67013968464517915,0.76357262144667037,0.82478730417868196,{"$f":"L4*(1-COS(beta))/2*L28*L24","v":0.71846706574939867},{"$f":"M4*(1-COS(beta))/2*M28*M24","v":0.52515754133252013},{"$f":"N4*(1-COS(beta))/2*N28*N24","v":0.33506984232258957},{"$f":"O4*(1-COS(beta))/2*O28*O24","v":0.20619682604467049},{"$f":"P4*(1-COS(beta))/2*P28*P24","v":0.15464761953350284}]

{"sheet":"ammortamento","index":12,"n_rows":26,"n_cols":8,"rows_kept":26,"cut":false,"hidden":false,"merged":[[19,2,20,10],[23,2,24,10],[6,7,6,8],[13,7,13,8]]}
[]
[]
[]
[]
[]
[null,null,"Costo stimato impianto:",null,null,null,null,"Costo annuo manutenz. [euro]:"]
[null,null,7000,"€",null,null,null,0]
[]
[]
[]
[null,null,"Contributi / sgravi fiscali:"]
[null,null,{"$f":"+incentivi!E47","v":787.91999999999985},"€"]
[null,null,null,null,null,null,null,"Investimento netto [euro]:"]
[null,null,null,null,null,null,null,{"$f":"+costo2-C12","v":6212.08}]
[]
[null,null,"Il vostro investimento vi permetterà di risparmiare da subito:"]
[null,null,{"$f":"+Tabelle6!E20","v":241},{"$f":"+Tabelle6!F20&\" per il primo anno;\"","v":"m3 di metano per il primo anno;"}]
[null,null,{"$f":"+Tabelle6!E21","v":204.85},"euro il primo anno di esercizio impianto."]
[]
[null,null,"Tenuto conto del tasso di aumento del combustibile, la tabella a lato vi fornisce un riepilogo dell'investimento durante la vita stimata dell'impianto solare."]
[]
[null,null,{"$f":"IF(tasso=0,(H14)/(C18-manut),LOG(1+tasso/100*(H14)/(C18-manut),1+tasso/100))","v":20.253313315516802},"anni per ammortizzare l'investimento"]
[]
[null,null,"Considerando una vita media dell'impianto pari a 20 anni, il vostro investimento in un impianto solare vi permetterà di guadagnare circa:"]
[]
[null,null,{"$f":"+cashflow!M39","v":123.76697211029727},"euro"]

{"sheet":"cti_show","index":13,"n_rows":49,"n_cols":12,"rows_kept":49,"cut":false,"hidden":false,"merged":[[48,3,48,10]]}
[]
[]
[]
[null,null,null,"Calcolo energia primaria per produzione A.C.S. (secondo UNI TS 11300-5)"]
[]
[null,null,null,"Rendimenti considerati:"]
[]
[null,null,null,"h w,er","- Rendimento di erogazione",null,null,{"$f":"+cti!E2","v":1}]
[null,null,null,"h w,d","- Rendimento di distribuzione",null,null,{"$f":"+cti!F7","v":0.92},"(Ricircolo assente; se presente, vedi sotto)"]
[null,null,null,"h w,c","- Rendimento di generazione",null,null,{"$f":"+cti!E16","v":0.9},{"$f":"+\"(\"&Tabelle6!B10&\")\"","v":"(Caldaia a condens. 4*)"}]
[]
[null,null,null,"Per le dispersioni della rete di ricircolo, si sono considerati i seguenti valori:"]
[]
[null,null,null,"Coefficiente dispersione tubazione:",null,null,null,{"$f":"+IF(Tabelle5!C36=FALSE,\"-\",+k_ricircolo)","v":0.4},"W/mK"]
[null,null,null,"Lunghezza semplice rete ricircolo:",null,null,null,{"$f":"+IF(Tabelle5!C36=FALSE,\"-\",+lung_ricircolo)","v":10},"m"]
[null,null,null,"Ore di funzionamento ricircolo al giorno:",null,null,null,{"$f":"+IF(Tabelle5!C36=FALSE,\"-\",+ore_ricircolo)","v":6},"ore / giorno"]
[null,null,null,"Temperatura distribuzione ACS:",null,null,null,{"$f":"+IF(Tabelle5!C36=FALSE,\"-\",+tdistrib_ricircolo)","v":48},"°C"]
[null,null,null,"Temperatura ambiente tubazione ricircolo:",null,null,null,{"$f":"+IF(Tabelle5!C36=FALSE,\"-\",+tamb_ricircolo)","v":18.4583333333333},"°C"]
[]
[null,null,null,"Per le dispersioni dell'accumulo solare:"]
[]
[null,null,null,{"$f":"\"Tipologia: \"& IF(sceltobollitore=FALSE,tab_bollitore!B58,\"bollitore di altra marca:\")","v":"Tipologia: Aqua 500"},null,null,null,{"$f":"+IF(sceltobollitore=TRUE,spessoreisolam,\"\")","v":""},{"$f":"+IF(sceltobollitore=TRUE,\"mm di isolamento\",\"\")","v":""}]
[null,null,null,null,null,null,null,{"$f":"+IF(sceltobollitore=TRUE,conducibilita,\"\")","v":""},{"$f":"+IF(sceltobollitore=TRUE,\"W/mk di dispersione termica\",\"\")","v":""}]
[null,null,null,"Riepilogo:"]
[null,null,null,null,"(1) energia utile per ACS",null,null,null,null,"Q h,w",{"$f":"+cti!E31","v":2652.5868055555557},"kWh"]
[null,null,null,null,"(2) perdite per distribuzione e ricircolo",null,null,null,null,"Q l,w,d",{"$f":"+cti!H31+cti!F31","v":470.99194444444475},"kWh"]
[null,null,null,null,"(3) perdite per erogazione",null,null,null,null,"Q l,w,er",{"$f":"+cti!G31","v":0},"kWh"]
[null,null,null,null,"(4) perdite di accumulo",null,null,null,null,"Q l,w,s",{"$f":"+cti!I31","v":574.65600000000006},"kWh"]
[null,null,null,null,"TOTALE ENERGIA DA FORNIRE",null,null,null,null,"Q w,gn, out",{"$f":"SUM(K25:K28)","v":3698.2347500000005},"kWh"]
[null,null,null,null,"di cui, ","da solare:",null,null,null,null,{"$f":"+cti!K31","v":1424.7176243433128},"kWh"]
[null,null,null,null,null,"da combustibile generatore:",null,null,null,null,{"$f":"+cti!M31","v":2273.5171256566873},"kWh"]
[null,null,null,null,null,{"$f":"IF(cti!H14=TRUE,\"da aria:\",\"\")","v":""},null,null,null,null,{"$f":"IF(cti!H14=TRUE,cti!L31,\"\")","v":""},{"$f":"IF(cti!H14=TRUE,\"kWh\",\"\")","v":""}]
[]
[null,null,null,null,"Energia consumata da generatore tradizionale:",null,null,null,null,"Q w,gn, in",{"$f":"+cti!M31+cti!N31","v":2526.1301396185413},"kWh"]
[null,null,null,null,"Energia elettrica ausiliari (pompa solare e carico bollitore)",null,null,null,null,"Q w,aux",{"$f":"+cti!Q31+cti!O31","v":68.111367981208929},"kWh"]
[]
[null,null,null,"Fattori di conversione energia primaria:",null,null,null,null,"fp,tot","fp,nren","fp,ren"]
[null,null,null,null,"Vettore energetico generatore tradizionale",null,null,null,{"$f":"+cti!T13","v":1.05},{"$f":"+cti!U13","v":1.05},{"$f":"+cti!V13","v":0}]
[null,null,null,null,"Energia elettrica per ausiliari",null,null,null,{"$f":"+cti!T12","v":2.42},{"$f":"+cti!U12","v":1.95},{"$f":"+cti!V12","v":0.47}]
[]
[null,null,null,"Copertura rinnovabile fabbisogno energia primaria ACS:",null,null,null,null,"Ep,tot","Ep,nren","Ep,ren"]
[null,null,null,null,"Vettore energetico generaotre tradizionale",null,null,null,{"$f":"+K34*I38","v":2652.4366465994685},{"$f":"+K34*J38","v":2652.4366465994685},{"$f":"+K34*K38","v":0}]
[null,null,null,null,"Vettore energia elettrica per ausiliari",null,null,null,{"$f":"+K35*I39","v":164.82951051452559},{"$f":"+K35*J39","v":132.8171675633574},{"$f":"+K35*K39","v":32.012342951168193}]
[null,null,null,null,"Vettore energetico solare",null,null,null,{"$f":"+K30","v":1424.7176243433128},0,{"$f":"+K30","v":1424.7176243433128}]
[null,null,null,null,{"$f":"IF(cti!H14=TRUE,\"Vettore energetico aria:\",\"\")","v":""},null,null,null,{"$f":"IF(cti!H14=TRUE,cti!L31,\"\")","v":""},{"$f":"IF(cti!H14=TRUE,0,\"\")","v":""},{"$f":"IF(cti!H14=TRUE,cti!L31,\"\")","v":""}]
[null,null,null,null,null,null,null,null,{"$f":"SUM(I42:I45)","v":4241.9837814573075},{"$f":"SUM(J42:J45)","v":2785.2538141628261},{"$f":"SUM(K42:K45)","v":1456.729967294481}]
[]
[null,null,null,null,"Quota copertura rinnovabili per acs QR:",null,null,null,"QR = Ep,ren","/ Ep,tot",{"$f":"+K46/I46","v":0.34340771731900172}]
[null,null,null,"Nel calcolo, sono state considerate trascurabili le perdite di calore\ndel circuito caldaia-bollitore (lungh. < 5 m ed isolate, secondo 6.9.4 UNI-TS).\nLe perdite di calore si considerano non recuperate.\nNel calcolo dell'energia primaria, non viene considerato il consumo elettrico della pompa ricircolo."]

{"sheet":"relazione_amm","index":14,"n_rows":39,"n_cols":10,"rows_kept":39,"cut":false,"hidden":false,"merged":[[38,2,40,11],[34,3,35,10],[6,5,6,9],[7,5,7,9],[9,5,9,6]]}
[]
[]
[]
[null,null,null,"Simulazione impianto solare"]
[null,null,null,"Foglio previsione ammortamento"]
[]
[null,null,null,"Committente:",null,{"$f":"+Dati!E6","v":"Nome committente"}]
[null,null,null,"Riferimento:",null,{"$f":"+Dati!E8","v":"Riferimento impianto"}]
[]
[null,null,null,"Data:",null,{"$f":"+TODAY()","v":"2021-01-26"}]
[]
[null,null,null,"Dati generali"]
[null,null,null,"Località e dati climatici:",null,null,null,null,{"$f":"+Dati!N6","v":"Ascoli Piceno"}]
[null,null,null,"Tipologia collettori:",null,null,null,null,{"$f":"+Dati!E11","v":"AQUA PLASMA"}]
[null,null,null,"Superficie collettori:",null,null,null,null,{"$f":"+superficie","v":2.4},"m2"]
[null,null,null,"Inclinazione:",null,null,null,null,{"$f":"+Dati!E13","v":45},"°"]
[null,null,null,"Azimut:",null,null,null,null,{"$f":"+Dati!N13","v":-5},"°"]
[]
[null,null,null,"Risultati solari:"]
[null,null,null,"Fornitura energia solare:",null,null,null,null,{"$f":"+pr_disp","v":2067.4372730127161},"kWh / anno"]
[null,null,null,{"$f":"+riepilogo!C23","v":"Resa dell'impianto solare:"},null,null,null,null,{"$f":"+riepilogo!F23","v":861.43219708863171},"kWh/m2 anno"]
[]
[null,null,null,"Foglio economico:"]
[null,null,null,"Costo stimato dell'investimento:",null,null,null,null,{"$f":"+costo2","v":7000},"euro"]
[null,null,null,"Sgravi / Contributi:",null,null,null,null,{"$f":"+ammortamento!C12","v":787.91999999999985},"euro"]
[null,null,null,"Costo annuo manutenzione:",null,null,null,null,{"$f":"+manut","v":0},"euro"]
[null,null,null,"Valore da ammortizzare:",null,null,null,null,{"$f":"+ammortamento!H14","v":6212.08},"euro"]
[]
[null,null,null,"Sulla base dei dati inseriti, l'investimento permetterà di risparmiare:"]
[null,null,null,{"$f":"+Tabelle6!E20","v":241},{"$f":"+Tabelle6!F20&\" di \"&Tabelle6!E10&\", pari a:\"","v":"m3 di metano di metano, pari a:"}]
[null,null,null,{"$f":"+Tabelle6!E21","v":204.85},"euro nel primo anno di esercizio."]
[]
[null,null,null,"Ammortamento impianto solare:",null,null,null,null,{"$f":"+ammortamento!C22","v":20.253313315516802},"anni"]
[]
[null,null,null,"Considerando una vita media dell'impianto pari a 20 anni, l'investimento in un impianto solare permetterà di guadagnare circa:"]
[]
[null,null,null,null,null,null,null,null,{"$f":"+cashflow!M39","v":123.76697211029727},"euro"]
[]
[null,null,"Non sono considerati i fenomeni di ombreggiamento e/o di ostruzione ai raggi solari dati \nda ostacoli presenti in sito o dal profilo orografico circostante.\nParadigma non fornisce alcuna garanzia, né esplicita né implicita e non si assume alcuna responsabilità \nper i dati forniti dalla presente simulazione. Essi sono puramente indicativi e soggetti a calcolo più dettagliato. \nParadigma non garantisce l'uso del software in tutte le situazioni. "]

{"sheet":"incentivi","index":15,"n_rows":47,"n_cols":10,"rows_kept":47,"cut":false,"hidden":true,"merged":[]}
[]
[]
[null,null,null,null,"% sgravio","massimale incentivo","testo1","testo2","> 50 m2","< 50 m2"]
[null,null,1,"Detrazioni fiscali per efficienza energetica (65%)",65,60000,"Detrazioni fiscali = 65%","Valore massimo detrazione = 60.000 € in 10 rate annuali."]
[null,null,2,"Detrazioni fiscali per ristrutturazione (50%)",50,48000,"Detrazioni fiscali = 50%","Valore massimo detrazione = 48.000 € in 10 rate annuali."]
[null,null,3,"Conto energia 2.0 per ACS",null,null,"nel caso di Plasma, calcolo effettuato con AP 15/40 - nel caso di Star, con Star 15/39","il calcolo è approssimato nel caso in cui la superficie inserita non sia multriplo esatto",55,170]
[null,null,4,"Conto energia 2.0 per ACS, riscaldamento",null," ","nel caso di Plasma, calcolo effettuato con AP 15/40 - nel caso di Star, con Star 15/39","il calcolo è approssimato nel caso in cui la superficie inserita non sia multriplo esatto",83,255]
[null,null,5,"Conto energia 2.0 per calore di processo",null,null,"nel caso di Plasma, calcolo effettuato con AP 15/40 - nel caso di Star, con Star 15/39","il calcolo è approssimato nel caso in cui la superficie inserita non sia multriplo esatto"]
[null,null,6,"Conto energia 2.0 per solar cooling",null,null,"nel caso di Plasma, calcolo effettuato con AP 15/40 - nel caso di Star, con Star 15/39","il calcolo è approssimato nel caso in cui la superficie inserita non sia multriplo esatto"]
[null,null,7,"Altro",null,null,"Immettere il valore del contributo in €"," "]
[null,null,3,{"$f":"+VLOOKUP(C11,C4:H10,2,FALSE)","v":"Conto energia 2.0 per ACS"},{"$f":"+VLOOKUP(C11,C4:H10,3,FALSE)","v":0},{"$f":"+VLOOKUP(C11,C4:H10,4,FALSE)","v":0},{"$f":"+VLOOKUP(C11,C4:H10,5,FALSE)","v":"nel caso di Plasma, calcolo effettuato con AP 15/40 - nel caso di Star, con Star 15/39"},{"$f":"+VLOOKUP(C11,C4:H10,6,FALSE)","v":"il calcolo è approssimato nel caso in cui la superficie inserita non sia multriplo esatto"},{"$f":"+VLOOKUP(C11,C4:J10,7,FALSE)","v":55},{"$f":"+VLOOKUP(C11,C4:J10,8,FALSE)","v":170}]
[]
[null,null,0,"valore inserito dall'utente nel caso di altro"]
[]
[]
[null,"m2",{"$f":"+superficie","v":2.4}]
[]
[null,"Calcolo incentivo per conto termico (dal foglio CT20)"]
[null,null,null,"totale incentivo","anni","rata"]
[null,"Considerata superficie:",null,{"$f":"+'CT20'!E25","v":787.91999999999985},{"$f":"+'CT20'!E24","v":2},{"$f":"+D20/E20","v":393.95999999999992}]
[]
[]
[]
[null,null,{"$f":"+costo2","v":7000},"spesa inserita"]
[]
[null,"Calcolo incentivo detrazioni fiscali"]
[null,null,{"$f":"+C24*E11/100","v":0},"detrazioni da %"]
[null,null,{"$f":"+IF(C27<F11,C27,F11)","v":0},"detrazioni da utilizzare (limitate superiormente)"]
[]
[]
[]
[null,"Riepilogo rata"]
[]
[null,"anno","rata conto energia","rata detrazioni","rata da usare nell'ammortamento"]
[null,1,{"$f":"+IF(B35<=$E$20,$F$20,0)","v":393.95999999999992},{"$f":"+$C$28/10","v":0},{"$f":"+IF(OR($C$11=1,$C$11=2),D35,IF(OR($C$11=3,$C$11=4,$C$11=5,$C$11=6),C35,IF($C$11=7,$C$13,0)))","v":393.95999999999992}]
[null,2,{"$f":"+IF(B36<=$E$20,$F$20,0)","v":393.95999999999992},{"$f":"+$C$28/10","v":0},{"$f":"+IF(OR($C$11=1,$C$11=2),D36,IF(OR($C$11=3,$C$11=4,$C$11=5,$C$11=6),C36,IF($C$11=7,0,0)))","v":393.95999999999992}]
[null,3,0,0,{"$f":"+IF(OR($C$11=1,$C$11=2),D37,IF(OR($C$11=3,$C$11=4,$C$11=5,$C$11=6),C37,IF($C$11=7,0,0)))","v":0}]
[null,4,0,0,0]
[null,5,0,0,0]
[null,6,0,0,0]
[null,7,0,0,0]
[null,8,0,0,0]
[null,9,0,0,0]
[null,10,0,0,0]
[null,null,{"$f":"SUM(C35:C44)","v":787.91999999999985},{"$f":"SUM(D35:D44)","v":0},{"$f":"SUM(E35:E44)","v":787.91999999999985}]
[]
[null,null,null,"valore da mostrare nel foglio AMMORTAMENTO:",{"$f":"+IF(incentivoutente>0,incentivoutente,E45)","v":787.91999999999985}]

{"sheet":"cti","index":16,"n_rows":60,"n_cols":33,"rows_kept":60,"cut":false,"hidden":true,"merged":[]}
[]
["erogazione","eta,w,er",null,null,1,"Valore precedente pari a 0,95 ed ora aggiornato a 1 secondo 11300 del 2014"]
[]
[null,null,null,"descrizione","f l,d,w"]
["distribuzione","eta, w,d",0,"Sistemi installati prima dell'entrata in vigore della legge 373/76",0.12]
[null,null,1,"Sistemi installati dopo dell'entrata in vigore della legge 373/76",0.08]
[null,null,1,{"$f":"+VLOOKUP(C7,C5:E6,2)","v":"Sistemi installati dopo dell'entrata in vigore della legge 373/76"},{"$f":"+VLOOKUP(C7,C5:E6,3)","v":0.08},{"$f":"1-E7","v":0.92},null,null,null,null,null,null,null,null,null,null,null,null,"potenza elettrica caldaia per acs",0.1,"kW"]
[]
[null,null,null,null,null,null,null,null,null,null,null,null,null,null,null,null,null,null,"temperatura bollitore per calcolo dispersioni termiche secondo UNITS 11300/4",60]
[null,null,null,null,"?"]
[null,null,null,null,null,null,null,null,null,null,null,null,null,null,null,null,null,null,null,"fp tot","fp nren","fp ren"]
[null,null,null,null,null,null,null,null,null,null,null,null,null,null,"conversione energia elettrica in primaria",null,null,null,null,2.42,1.95,0.47,"vedi decreto di agosto 2015"]
[null,null,null,null,null,null,"ricircolo_sino",{"$f":"+ricircolo_sino","v":true},null,null,null,null,null,null,"conversione energia primaria comnbustibile ",null,null,null,null,{"$f":"+Tabelle6!L10","v":1.05},{"$f":"+Tabelle6!N10","v":1.05},{"$f":"+Tabelle6!O10","v":0},"(da Tabelle6)",null,null,null,"Fabbisogno elettrico solare"]
[null,null,null,null,null,null,"generatore prinicpale PDC?",{"$f":"+Tabelle6!P10","v":false}]
[null,null,null,null,null,null,null,null,null,null,null,null,null,null,null,null,null,null,null,null,null,null,null,null,null,null,"Waux,nom",{"$f":"50+5*superficie","v":62},"Watt",null,"Aquasys"]
["combustione","eta, c",null,"Rendimento per ACS",{"$f":"+Tabelle6!D11/100","v":0.9},"dal foglio \"tabelle 6\" (nel caso di PDC, trattasi di COPN 55/7*C)",null,null,null,null,null,null,null,null,null,null,null,"energia",null,null,null,null,null,null,null,null,null,null,null,null,"taux,w,m"]
[null,null,null,null,null,null,null,null,"storage",null,"di cui",null,null,"perdite",null,"h caldaia acs","Qaux,gn,W","primaria",null,null,null,null,"hwh = hwh,calc x 0,95 = f x COPN x 0,95",null,null,null,null,"Isol / Isol tot","ore/mese","taux,w,m",{"$f":"+aquasys","v":true},"nel caso di sistema Aqua, le ore di funzionamento vengono diminuite al 46,2% (vedi UT 05/2008)"]
[null,null,null,null,"Qhw","Qi,w,d ricircolo","Ql,w,er","Qi,w,d","Qi,w,s","TOTALE","da solare","da aria","da generatore","Ql, gn","Qsol,aux","h","kWh","Qpw","Qpw ren","Qpw nonren",null,"t.esterna","COPN (t.ext) x f x 0,95",null,null,null,"gen",{"$f":"+fc!W35/SUM(fc!$W$35:$W$46)","v":4.8841480056723924E-2},{"$f":"2000*AB18","v":97.682960113447848},{"$f":"+AC18*fc!E35","v":29.664145898717425},{"$f":"+IF(aquasys,AD18*0.462,AD18)","v":13.704835405207451}]
[null,null,31,"gen",{"$f":"+Tabelle5!E44","v":225.28819444444446},{"$f":"+Tabelle5!H44","v":21.979000000000024},{"$f":"+E19*(1-$E$2)/$E$2","v":0},{"$f":"+(E19+G19)*$E$7","v":18.023055555555558},{"$f":"+tab_bollitore!$J$58*24*C19*($T$9-tempcentr)/1000","v":48.806400000000004},{"$f":"+E19+F19+G19+H19+I19","v":314.09665000000001},{"$f":"+fc!AD35","v":29.483904726727626},{"$f":"(J19-K19)*(1-1/W19)*$H$14","v":0},{"$f":"+J19-K19-L19","v":284.61274527327237},{"$f":"+M19*(1-$E$16)/$E$16*(1-$H$14)","v":31.623638363696923},{"$f":"+AE18*$AB$15/1000","v":0.84969979512286198},{"$f":"(E19+F19+G19+H19+I19+N19-fc!AD35)/potenza_gen_acs","v":35.137375959663252},{"$f":"+P19*$T$7","v":3.5137375959663255},{"$f":"+(M19+N19)*$T$13+K19+L19+(Q19+O19)*$T$12","v":372.09162603198121},{"$f":"+(M19+N19)*$V$13+(Q19+O19)*$V$12+K19+L19","v":31.534720300539544},{"$f":"+(M19+N19)*$U$13+(O19+Q19)*$U$12","v":340.55690573144165},null,{"$f":"+'Dettaglio mesi'!E37","v":5.5},{"$f":"+VLOOKUP(V19,Tabelle6!$K$18:$M$73,3,TRUE)/100*0.919*0.95","v":0.73910966014424728},null,null,null,"feb",{"$f":"+fc!W36/SUM(fc!$W$35:$W$46)","v":5.8321745108960349E-2},{"$f":"2000*AB19","v":116.6434902179207},{"$f":"+AC19*fc!E36","v":34.860033276030194},16.10533537352595]
[null,null,28,"feb",{"$f":"+Tabelle5!E45","v":203.48611111111114},{"$f":"+Tabelle5!H45","v":19.852000000000022},{"$f":"+E20*(1-$E$2)/$E$2","v":0},{"$f":"+(E20+G20)*$E$7","v":16.278888888888893},{"$f":"+tab_bollitore!$J$58*24*C20*($T$9-tempcentr)/1000","v":44.083199999999998},{"$f":"+E20+F20+G20+H20+I20","v":283.70020000000005},{"$f":"+fc!AD36","v":37.132938665304884},{"$f":"(J20-K20)*(1-1/W20)*$H$14","v":0},246.56726133469516,{"$f":"+M20*(1-$E$16)/$E$16*(1-$H$14)","v":27.396362370521679},{"$f":"+AE19*$AB$15/1000","v":0.99853079315860882},{"$f":"(E20+F20+G20+H20+I20+N20-fc!AD36)/potenza_gen_acs","v":30.440402633912981},3.0440402633912984,{"$f":"+(M20+N20)*$T$13+K20+L20+(Q20+O20)*$T$12","v":334.57776551263339},{"$f":"+(M20+N20)*$V$13+(Q20+O20)*$V$12+K20+L20","v":39.032947061883341},{"$f":"+(M20+N20)*$U$13+(O20+Q20)*$U$12","v":295.54481845075003},null,{"$f":"+'Dettaglio mesi'!F37","v":6.6},{"$f":"+VLOOKUP(V20,Tabelle6!$K$18:$M$73,3,TRUE)/100*0.919*0.95","v":0.76244541761945894},null,null,null,"mar",{"$f":"+fc!W37/SUM(fc!$W$35:$W$46)","v":8.3113507647351953E-2},166.2270152947039,{"$f":"+AC20*fc!E37","v":62.481444339211841},28.866427284715872]
[null,null,31,"mar",{"$f":"+Tabelle5!E46","v":225.28819444444446},{"$f":"+Tabelle5!H46","v":21.979000000000024},0,18.023055555555558,{"$f":"+tab_bollitore!$J$58*24*C21*($T$9-tempcentr)/1000","v":48.806400000000004},{"$f":"+E21+F21+G21+H21+I21","v":314.09665000000001},{"$f":"+fc!AD37","v":68.663569130781795},0,245.4330808692182,27.270342318802015,1.7897184916523841,{"$f":"(E21+F21+G21+H21+I21+N21-fc!AD37)/potenza_gen_acs","v":30.300380354224469},3.030038035422447,366.66597427372415,70.928854698506967,295.73711957521715,null,{"$f":"+'Dettaglio mesi'!G37","v":9.5},{"$f":"+VLOOKUP(V21,Tabelle6!$K$18:$M$73,3,TRUE)/100*0.919*0.95","v":0.84861125560996997},null,null,null,"apr",{"$f":"+fc!W38/SUM(fc!$W$35:$W$46)","v":9.1260420768000464E-2},182.52084153600092,{"$f":"+AC21*fc!E38","v":87.129425251396157},40.253794466145024]
[null,null,30,"apr",{"$f":"+Tabelle5!E47","v":218.02083333333337},{"$f":"+Tabelle5!H47","v":21.270000000000024},0,17.44166666666667,{"$f":"+tab_bollitore!$J$58*24*C22*($T$9-tempcentr)/1000","v":47.231999999999999},{"$f":"+E22+F22+G22+H22+I22","v":303.96450000000004},{"$f":"+fc!AD38","v":95.69445617959542},0,208.27004382040462,23.141115980044951,2.4957352569009914,{"$f":"(E22+F22+G22+H22+I22+N22-fc!AD38)/potenza_gen_acs","v":25.712351088938842},2.5712351088938843,350.93824225529107,98.075932251519006,252.86231000377208,null,{"$f":"+'Dettaglio mesi'!H37","v":13.3},{"$f":"+VLOOKUP(V22,Tabelle6!$K$18:$M$73,3,TRUE)/100*0.919*0.95","v":0.99123602337579042},null,null,null,"mag",{"$f":"+fc!W39/SUM(fc!$W$35:$W$46)","v":9.9818777818716592E-2},199.63755563743319,{"$f":"+AC22*fc!E39","v":138.37013451961303},63.927002148061227]
[null,null,31,"mag",{"$f":"+Tabelle5!E48","v":225.28819444444446},{"$f":"+Tabelle5!H48","v":21.979000000000024},0,18.023055555555558,{"$f":"+tab_bollitore!$J$58*24*C23*($T$9-tempcentr)/1000","v":48.806400000000004},{"$f":"+E23+F23+G23+H23+I23","v":314.09665000000001},{"$f":"+fc!AD39","v":146.71505652075328},0,167.38159347924673,18.597954831027408,3.9634741331797958,{"$f":"(E23+F23+G23+H23+I23+N23-fc!AD39)/potenza_gen_acs","v":20.664394256697122},2.0664394256697123,356.58597305895694,149.54911589341253,207.0368571655444,null,{"$f":"+'Dettaglio mesi'!I37","v":17.2},{"$f":"+VLOOKUP(V23,Tabelle6!$K$18:$M$73,3,TRUE)/100*0.919*0.95","v":1.1575222818021962},null,null,null,"giu",{"$f":"+fc!W40/SUM(fc!$W$35:$W$46)","v":0.10339183624994515},206.78367249989029,{"$f":"+AC23*fc!E40","v":206.78367249989029},95.534056694949314]
[null,null,30,"giu",{"$f":"+Tabelle5!E49","v":218.02083333333337},{"$f":"+Tabelle5!H49","v":21.270000000000024},0,17.44166666666667,{"$f":"+tab_bollitore!$J$58*24*C24*($T$9-tempcentr)/1000","v":47.231999999999999},{"$f":"+E24+F24+G24+H24+I24","v":303.96450000000004},{"$f":"+fc!AD40","v":205.66772587810195},0,98.296774121898096,10.921863791322009,5.9231115150868572,{"$f":"(E24+F24+G24+H24+I24+N24-fc!AD40)/potenza_gen_acs","v":12.135404212580008},1.213540421258001,337.61799337293758,209.02195228818402,128.59604108475358,null,{"$f":"+'Dettaglio mesi'!J37","v":21.7},{"$f":"+VLOOKUP(V24,Tabelle6!$K$18:$M$73,3,TRUE)/100*0.919*0.95","v":1.3491804294563441},null,null,null,"lug",{"$f":"+fc!W41/SUM(fc!$W$35:$W$46)","v":0.11825968263897632},236.51936527795263,{"$f":"+AC24*fc!E41","v":236.51936527795263},109.27194675841412]
[null,null,31,"lug",{"$f":"+Tabelle5!E50","v":225.28819444444446},{"$f":"+Tabelle5!H50","v":21.979000000000024},0,18.023055555555558,{"$f":"+tab_bollitore!$J$58*24*C25*($T$9-tempcentr)/1000","v":48.806400000000004},314.09665000000001,{"$f":"+fc!AD41","v":233.05894809271419},0,81.037701907285822,9.0041891008095334,6.7748606990216746,{"$f":"(E25+F25+G25+H25+I25+N25-fc!AD41)/potenza_gen_acs","v":10.004654556455039},1.0004654556455039,346.41922294550886,236.71335138540778,109.70587156010112,null,{"$f":"+'Dettaglio mesi'!K37","v":24.4},{"$f":"+VLOOKUP(V25,Tabelle6!$K$18:$M$73,3,TRUE)/100*0.919*0.95","v":1.5109441688282843},null,null,null,"ago",{"$f":"+fc!W42/SUM(fc!$W$35:$W$46)","v":0.1167954156596622},233.59083131932439,{"$f":"+AC25*fc!E42","v":233.59083131932439},107.91896406952787]
[null,null,31,"ago",{"$f":"+Tabelle5!E51","v":225.28819444444446},{"$f":"+Tabelle5!H51","v":21.979000000000024},0,18.023055555555558,{"$f":"+tab_bollitore!$J$58*24*C26*($T$9-tempcentr)/1000","v":48.806400000000004},314.09665000000001,{"$f":"+fc!AD42","v":230.6481488870127},0,83.448501112987316,9.2720556792208111,6.690975772310729,{"$f":"(E26+F26+G26+H26+I26+N26-fc!AD42)/potenza_gen_acs","v":10.302284088023121},1.0302284088023121,346.69004763712479,234.27711485213581,112.41293278498897,null,{"$f":"+'Dettaglio mesi'!L37","v":24.3},{"$f":"+VLOOKUP(V26,Tabelle6!$K$18:$M$73,3,TRUE)/100*0.919*0.95","v":1.5109441688282843},null,null,null,"set",{"$f":"+fc!W43/SUM(fc!$W$35:$W$46)","v":9.9097247911574954E-2},198.19449582314991,{"$f":"+AC26*fc!E43","v":198.19449582314991},91.565857070295266]
[null,null,30,"set",{"$f":"+Tabelle5!E52","v":218.02083333333337},{"$f":"+Tabelle5!H52","v":21.270000000000024},0,17.44166666666667,{"$f":"+tab_bollitore!$J$58*24*C27*($T$9-tempcentr)/1000","v":47.231999999999999},303.96450000000004,{"$f":"+fc!AD43","v":197.9578426728805},0,106.00665732711954,11.778517480791056,5.6770831383583067,{"$f":"(E27+F27+G27+H27+I27+N27-fc!AD43)/potenza_gen_acs","v":13.087241645323397},1.3087241645323398,338.53792989418201,201.24117210523912,137.2967577889429,null,{"$f":"+'Dettaglio mesi'!M37","v":21.1},{"$f":"+VLOOKUP(V27,Tabelle6!$K$18:$M$73,3,TRUE)/100*0.919*0.95","v":1.3491804294563441},null,null,null,"ott",{"$f":"+fc!W44/SUM(fc!$W$35:$W$46)","v":7.9479831134629045E-2},158.9596622692581,{"$f":"+AC27*fc!E44","v":95.518951255668171},44.129755480118696]
[null,null,31,"ott",{"$f":"+Tabelle5!E53","v":225.28819444444446},{"$f":"+Tabelle5!H53","v":21.979000000000024},0,18.023055555555558,{"$f":"+tab_bollitore!$J$58*24*C28*($T$9-tempcentr)/1000","v":48.806400000000004},314.09665000000001,{"$f":"+fc!AD44","v":102.92349702250959},0,211.17315297749042,23.463683664165597,2.7360448397673589,{"$f":"(E28+F28+G28+H28+I28+N28-fc!AD44)/potenza_gen_acs","v":26.07075962685067},2.6070759626850672,362.22252783818328,105.43476379966224,256.78776403852106,null,{"$f":"+'Dettaglio mesi'!N37","v":15.8},{"$f":"+VLOOKUP(V28,Tabelle6!$K$18:$M$73,3,TRUE)/100*0.919*0.95","v":1.0713266606008709},null,null,null,"nov",{"$f":"+fc!W45/SUM(fc!$W$35:$W$46)","v":5.571968143008061E-2},111.43936286016122,{"$f":"+AC28*fc!E45","v":44.808746408222653},20.701640840598866]
[null,null,30,"nov",{"$f":"+Tabelle5!E54","v":218.02083333333337},{"$f":"+Tabelle5!H54","v":21.270000000000024},0,17.44166666666667,{"$f":"+tab_bollitore!$J$58*24*C29*($T$9-tempcentr)/1000","v":47.231999999999999},303.96450000000004,{"$f":"+fc!AD45","v":47.192686731601093},0,256.77181326839894,28.530201474266544,1.2835017321171296,{"$f":"(E29+F29+G29+H29+I29+N29-fc!AD45)/potenza_gen_acs","v":31.700223860296166},3.1700223860296166,357.53733057731506,49.285843067130067,308.25148751018497,null,{"$f":"+'Dettaglio mesi'!O37","v":10.9},{"$f":"+VLOOKUP(V29,Tabelle6!$K$18:$M$73,3,TRUE)/100*0.919*0.95","v":0.88212473639914091},null,null,null,"dic",{"$f":"+fc!W46/SUM(fc!$W$35:$W$46)","v":4.5900373575378392E-2},91.800747150756777,{"$f":"+AC29*fc!E46","v":30.041863989107249},13.879341162967549]
[null,null,31,"dic",{"$f":"+Tabelle5!E55","v":225.28819444444446},{"$f":"+Tabelle5!H55","v":21.979000000000024},0,18.023055555555558,{"$f":"+tab_bollitore!$J$58*24*C30*($T$9-tempcentr)/1000","v":48.806400000000004},314.09665000000001,{"$f":"+fc!AD46","v":29.578849835329798},0,284.51780016467023,31.613088907185571,0.86051915210398811,{"$f":"(E30+F30+G30+H30+I30+N30-fc!AD46)/potenza_gen_acs","v":35.125654341317308},3.5125654341317309,372.0991480594688,31.634199590860586,340.46494846860821,null,{"$f":"+'Dettaglio mesi'!P37","v":7},{"$f":"+VLOOKUP(V30,Tabelle6!$K$18:$M$73,3,TRUE)/100*0.919*0.95","v":0.78574500000000003}]
[null,null,null,null,{"$f":"SUM(E19:E30)","v":2652.5868055555557},258.78500000000025,0,212.2069444444445,574.65600000000006,3698.2347500000001,1424.7176243433128,0,2273.5171256566873,252.61301396185411,40.043255318780687,null,{"$f":"SUM(Q19:Q30)","v":28.068112662428234},{"$f":"SUM(R19:R30)","v":4241.9837814573075},{"$f":"SUM(S19:S30)","v":1456.729967294481},{"$f":"SUM(T19:T30)","v":2785.2538141628261},{"$f":"+S31/R31","v":0.34340771731900172},null,null,null,null,null,null,{"$f":"SUM(AB18:AB30)","v":1},2000,{"$f":"SUM(AD18:AD29)","v":1397.963109858284},{"$f":"SUM(AE18:AE29)","v":645.85895675452718},{"$f":"+AE31*AB15","v":40043.255318780684},{"$f":"+AF31/1000","v":40.043255318780687}]
[null,null,null,null,null,{"$f":"+F31/E31","v":9.7559483994266699E-2},{"$f":"+G31/E31","v":0},{"$f":"+H31/E31","v":8.0000000000000016E-2},{"$f":"+I31/E31","v":0.21663984710941234},null,null,null,null,null,null,null,null,null,null,null,null,null,null,null,null,null,null,null,null,null,null,"Wh","kWh"]
[]
["rendimento globale ACS",null,null,null,"?"]
[]
[null,null,null,"ADOTTA IL CALCOLO CTI","?"]
[null,null,null,"COPERTURA SOLARE EN.PRIM.ACS","?"]
[]
[]
[]
["Rendimenti per riscaldamento:"]
[]
["emissione",null,null,"descrizione","eta"]
[null,null,1,"Ad aria (termoconv., venticonv.)",0.98]
[null,null,2,"Radiatori",0.96]
[null,null,3,"Pannelli radianti",0.96]
[null,null,4,"--- non presente riscaldamento ---",1]
[null,null,4,{"$f":"+VLOOKUP(C48,C44:E47,2)","v":"--- non presente riscaldamento ---"},{"$f":"+VLOOKUP(C48,C44:E47,3)","v":1}]
[]
[]
["regolazione",null,null,null,98,null,"%"]
[null,null,null,null,{"$f":"+regolaz_risc/100","v":0.98}]
[]
["distribuzione",null,null,null,92,null,"%"]
[null,null,null,null,{"$f":"+distrib_risc/100","v":0.92}]
[]
["combustione","eta, c",null,"dal foglio TABELLE6",{"$f":"+Tabelle6!C11/100","v":0.91}]
[]
[]
["rendimento globale RISC",null,null,null,{"$f":"+E48*E52*E55*E57","v":0.82045600000000007}]

{"sheet":"fc","index":17,"n_rows":55,"n_cols":34,"rows_kept":55,"cut":false,"hidden":true,"merged":[]}
[]
[]
[null,"Fabbisogno applicato all'impianto solare per acqua calda sanitaria",null,null,null,null,null,null,"QW,gn,out",{"$f":"+S47","v":3698.2347500000001},"kWh/anno",null,null,null,null,null,null,null,null,null,"XH","XW","YH","YW"]
[null,"Fabbisogno applicato all'impianto solare per riscaldamento",null,null,null,null,null,null,"QH,gn,out",{"$f":"+R47","v":3685.5000000000009},"kWh/anno"]
[null,null,null,null,null,null,null,null,null,null,null,null,null,null,null,null,null,null,null,null,{"$f":"+$F35*$D$20*$D$22*Q35*$J35*M35/(R35*1000)","v":0.42417892031441351},{"$f":"+$G35*$D$20*$D$22*P35*$K35*M35/(S35*1000)","v":0.46655192568762044},{"$f":"+$F35*$J$10*$J$7*$D$22*W35/(R35*1000)","v":0.12393096521454382},{"$f":"+$G35*$J$10*$J$7*$D$22*W35/(S35*1000)","v":0.12393096521454379}]
[null,"Superficie di apertura collettore solare",null,null,null,null,null,null,"A",{"$f":"+superficie","v":2.4},"m2",null,null,null,null,null,null,null,null,null,0.41258972136629968,{"$f":"+$G36*$D$20*$D$22*P36*$K36*M36/(S36*1000)","v":0.44787630267544315},0.16124247044113832,{"$f":"+$G36*$J$10*$J$7*$D$22*W36/(S36*1000)","v":0.16124247044113832}]
[null,"Coefficienti collettore solare",null,null,null,null,null,null,"h0",{"$f":"+eta0","v":0.68700000000000006},null,null,null,null,null,null,null,null,null,null,0.50280810487503613,0.52592061002730273,0.2610351813733533,0.2610351813733533]
[null,null,null,null,null,null,null,null,"a1",{"$f":"+kappa1","v":0.61299999999999999},null,null,null,null,null,null,null,null,null,null,0.61175245552078983,0.60571254661737783,0.37614324939914079,0.37614324939914079]
[null,null,null,null,null,null,null,null,"a2",{"$f":"+kappa2","v":3.0000000000000001E-3},null,null,null,null,null,null,null,null,null,null,0.84827114314082275,0.78676124044254314,0.5780831980273986,0.57808319802739849]
[null,null,null,null,null,null,null,null,"IAM",{"$f":"+IAM","v":1},null,null,null,null,null,null,null,null,null,null,{"$error":"#DIV/0!"},0.98080898459277255,{"$error":"#DIV/0!"},0.89269821615803824]
[null,"Coerrifiente di scambio termico dello scambiatore di calore",null,null,null,null,null,null,"(Ust)hx",2300,"W/K",null,null,null,null,null,null,null,null,null,{"$error":"#DIV/0!"},0.88822071104570666,{"$error":"#DIV/0!"},0.98813137350754721]
[null,"Volume serbatoio riscaldato dal solare",null,null,null,null,null,null,"Vnom",{"$f":"+tab_bollitore!C58","v":543},"litri",null,null,null,null,null,null,null,null,null,{"$error":"#DIV/0!"},0.8916499063622646,{"$error":"#DIV/0!"},0.97589653481050387]
[null,null,null,null,null,null,null,null,null,null,null,null,null,null,null,null,null,null,null,null,{"$error":"#DIV/0!"},1.0013841564921209,{"$error":"#DIV/0!"},0.85561819622756519]
[null,null,null,null,null,null,null,null,null,null,null,null,null,null,null,null,null,null,null,null,0.74785765367067736,0.71094439466051895,0.39905938521923673,0.39905938521923667]
[null,null,null,null,null,null,null,null,null,null,null,null,null,null,null,null,null,null,null,null,0.52954895421547421,0.54328988779736165,0.19344219736168713,0.19344219736168719]
[null,null,null,null,null,null,null,null,null,null,null,null,null,null,null,null,null,null,null,null,0.44985012478435632,0.48593487672942387,0.12550899708105473,0.1255089970810547]
[null,"Rapporto","PW","??"]
[null,null,"PH","??"]
[]
[null,null,"Uloop",{"$f":"+J8+40*J9+(5+0.5*J6)/IF(J6=0,0.0000000000000000001,J6)","v":3.3163333333333336},"W/m2 K",null,null,null,null,null,null,"Temperatura di riferimento, imp.acs","vedi calcolo mensile"]
[null,null,"Dh",{"$f":"+J7*J6*J8/J11","v":4.3944104347826081E-4},null,null,null,null,null,null,null,"Temperatura di riferimento, imp.risc",100,"°C"]
[null,null,"hloop",{"$f":"+IF(aquasys,1,0.8)","v":1},{"$f":"1-D21","v":0.99956055895652174}]
[]
[null,null,null,null,null,null,null,null,null,null,null,null,null,null,null,"Vsol"]
[null,null,null,null,null,null,null,null,null,null,null,"Vsol",{"$f":"+VLOOKUP(N25,O25:P28,2,FALSE)","v":476.4},{"$f":"+IF(preriscaldo,1,2)","v":2},1,{"$f":"+J12","v":543},"1 = preriscaldo"]
[null,null,null,null,null,null,null,null,null,null,null,null,null,null,2,{"$f":"+J12*(1-R27)","v":476.4},"2 = bollitore con solare tradiz. (solare sotto, caldaia sopra)"]
[null,null,null,null,null,null,null,null,null,null,null,null,null,null,null,null,"f aux =",{"$f":"+tab_bollitore!D59*U27","v":0.12265193370165746},null,"x =",{"$f":"+IF(aquasys,0.3,1)","v":0.3}]
[]
[]
[null,null,null,null,null,null,null,null,null,null,null,null,null,null,null,null,null,"PDC?"]
[null,null,null,null,null,null,null,null,null,null,null,null,null,null,null,null,null,{"$f":"+Tabelle6!P10","v":false}]
[]
[null,null,null,"pH","pW","A*pH","A*pW","Vol_H","Vol_W","fst_H","fst_W",null,"tm","Te,avg","Tref, acs","DTW","DTH","QH,gn,out","QW,gn,out","Qgn,out","XH","XW","Im",null,"YH","YW","Qsol,out H","Qsol,out W","Qsol,out H","Qsol,out W","Qsol,out","f","fH","fW"]
[null,null,null,null,null,null,null,null,null,null,null,null,"ore","°C","°C","K",null,"[kWh]","[kWh]","[kWh]",null,null,"Wh/m2","kWh/m2",null,null,"kWh","kWh","kWh","kWh","kWh"]
[null,null,"gen",{"$f":"+R35/(R35+S35)","v":0.69632220538499401},{"$f":"+S35/(R35+S35)","v":0.30367779461500588},{"$f":"+$J$6*D35","v":1.6711732929239855},{"$f":"+$J$6*E35","v":0.72882670707601405},{"$f":"+$M$25*D35","v":331.72789864541113},{"$f":"+$M$25*E35","v":144.67210135458879},{"$f":"+(F35*75/H35)^0.25","v":0.78401647356852311},{"$f":"+(G35*75/I35)^0.25","v":0.78401647356852311},null,{"$f":"31*24","v":744},{"$f":"+'Dettaglio mesi'!E37","v":5.5},{"$f":"11.6+1.18*40+3.86*15-1.32*N35","v":109.43999999999998},{"$f":"+O35-N35","v":103.93999999999998},{"$f":"+$M$21-N35","v":94.5},{"$f":"IF(INTEGRAZ,fabb_risc!D36,0)*IF($R$31=TRUE,1,(Tabelle6!$C$11/100))","v":720.2122641509435},{"$f":"IF(ACS,cti!E19+cti!F19+cti!G19+cti!H19+cti!I19,0)","v":314.09665000000001},{"$f":"+S35+R35","v":1034.3089141509436},{"$f":"+IF(U5<0,0,IF(U5>18,18,U5))","v":0.42417892031441351},{"$f":"+IF(V5<0,0,IF(V5>18,18,V5))","v":0.46655192568762044},{"$f":"1000*X35","v":77743.147780648447},{"$f":"+'UNI8477'!E18","v":77.743147780648442},{"$f":"+IF(W5<0,0,IF(W5>3,3,W5))","v":0.12393096521454382},{"$f":"+IF(X5<0,0,IF(X5>3,3,X5))","v":0.12393096521454379},{"$f":"+($E$50*Y35+$E$51*U35+$E$52*Y35^2+$E$53*U35^2+$E$54*Y35^3+$E$55*U35^3)*R35","v":69.540239727241769},{"$f":"+($E$50*Z35+$E$51*V35+$E$52*Z35^2+$E$53*V35^2+$E$54*Z35^3+$E$55*V35^3)*S35","v":29.483904726727626},{"$f":"+IF(R35=0,0,IF(AA35<0,0,IF(AA35>R35,R35,AA35)))","v":69.540239727241769},{"$f":"+IF(S35=0,0,IF(AB35<0,0,IF(AB35>S35,S35,AB35)))","v":29.483904726727626},{"$f":"+AD35+AC35","v":99.024144453969399},{"$f":"+AE35/T35","v":9.5739428616698694E-2},{"$f":"+AC35/R35","v":9.6555200721585313E-2},{"$f":"+AD35/S35","v":9.3868892669589518E-2}]
[null,null,"feb",0.70114034472989017,0.29885965527010971,1.6827368273517365,0.71726317264826334,{"$f":"+$M$25*D36","v":334.02326022931965},142.37673977068027,0.78401647356852311,0.784016473568523,null,{"$f":"28*24","v":672},{"$f":"+'Dettaglio mesi'!F37","v":6.6},107.98799999999999,101.38799999999999,93.4,{"$f":"IF(INTEGRAZ,fabb_risc!E36,0)*IF($R$31=TRUE,1,(Tabelle6!$C$11/100))","v":665.57547169811335},{"$f":"IF(ACS,cti!E20+cti!F20+cti!G20+cti!H20+cti!I20,0)","v":283.70020000000005},949.27567169811346,{"$f":"+IF(U6<0,0,IF(U6>18,18,U6))","v":0.41258972136629968},0.44787630267544315,92833.305697643606,{"$f":"+'UNI8477'!F18","v":92.83330569764361},{"$f":"+IF(W6<0,0,IF(W6>3,3,W6))","v":0.16124247044113832},{"$f":"+IF(X6<0,0,IF(X6>3,3,X6))","v":0.16124247044113832},88.606018124600041,37.132938665304884,88.606018124600041,37.132938665304884,125.73895678990493,0.1324577891741148,0.13312692833847292,0.13088795378115659]
[null,null,"mar",0.62411979648170623,0.37588020351829382,1.497887511556095,0.90211248844390513,{"$f":"+$M$25*D37","v":297.33067104388482},179.06932895611516,0.78401647356852311,0.78401647356852311,null,{"$f":"31*24","v":744},{"$f":"+'Dettaglio mesi'!G37","v":9.5},104.15999999999998,94.659999999999982,90.5,{"$f":"IF(INTEGRAZ,fabb_risc!F36,0)*IF($R$31=TRUE,1,(Tabelle6!$C$11/100))","v":521.53301886792474},{"$f":"IF(ACS,cti!E21+cti!F21+cti!G21+cti!H21+cti!I21,0)","v":314.09665000000001},835.62966886792469,0.50280810487503613,0.52592061002730273,132295.45255573379,{"$f":"+'UNI8477'!G18","v":132.29545255573379},0.2610351813733533,0.2610351813733533,114.7716929144397,68.663569130781795,114.7716929144397,68.663569130781795,183.43526204522149,0.2195174116947424,0.22006601454222591,0.21860649940323079]
[null,null,"apr",0.52263300717791994,0.47736699282208006,1.2543192172270079,1.145680782772992,{"$f":"+$M$25*D38","v":248.98236461956105},227.41763538043892,0.78401647356852311,0.78401647356852311,null,{"$f":"30*24","v":720},{"$f":"+'Dettaglio mesi'!H37","v":13.3},99.143999999999991,85.843999999999994,86.7,{"$f":"IF(INTEGRAZ,fabb_risc!G36,0)*IF($R$31=TRUE,1,(Tabelle6!$C$11/100))","v":332.78773584905662},{"$f":"IF(ACS,cti!E22+cti!F22+cti!G22+cti!H22+cti!I22,0)","v":303.96450000000004},636.75223584905666,0.61175245552078983,0.60571254661737783,145263.25512762752,{"$f":"+'UNI8477'!H18","v":145.26325512762753},0.37614324939914079,0.37614324939914079,104.64237500571312,95.69445617959542,104.64237500571312,95.69445617959542,200.33683118530854,0.31462289397095855,0.31444180098384406,0.31482115898269503]
[null,null,"mag",0.3068932642567988,0.69310673574320114,0.73654383421631708,1.6634561657836826,{"$f":"+$M$25*D39","v":146.20395109193893},330.19604890806102,0.78401647356852311,0.78401647356852311,null,{"$f":"31*24","v":744},{"$f":"+'Dettaglio mesi'!I37","v":17.2},93.995999999999981,76.795999999999978,82.8,{"$f":"IF(INTEGRAZ,fabb_risc!H36,0)*IF($R$31=TRUE,1,(Tabelle6!$C$11/100))","v":139.07547169811326},{"$f":"IF(ACS,cti!E23+cti!F23+cti!G23+cti!H23+cti!I23,0)","v":314.09665000000001},453.1721216981133,0.84827114314082275,{"$f":"+IF(V9<0,0,IF(V9>18,18,V9))","v":0.78676124044254314},158885.97123247621,{"$f":"+'UNI8477'!I18","v":158.88597123247621},0.5780831980273986,0.57808319802739849,64.431511955457793,146.71505652075328,64.431511955457793,146.71505652075328,211.14656847621109,0.46593018053495622,0.46328451141490457,0.46710162786121173]
[null,null,"giu",0,1,0,2.4,0,476.4,{"$error":"#DIV/0!"},0.78401647356852311,null,{"$f":"30*24","v":720},{"$f":"+'Dettaglio mesi'!J37","v":21.7},88.055999999999983,66.35599999999998,78.3,{"$f":"IF(INTEGRAZ,fabb_risc!I36,0)*IF($R$31=TRUE,1,(Tabelle6!$C$11/100))","v":0},{"$f":"IF(ACS,cti!E24+cti!F24+cti!G24+cti!H24+cti!I24,0)","v":303.96450000000004},303.96450000000004,{"$error":"#DIV/0!"},0.98080898459277255,164573.36664566357,{"$f":"+'UNI8477'!J18","v":164.57336664566358},{"$error":"#DIV/0!"},0.89269821615803824,{"$error":"#DIV/0!"},205.66772587810195,0,205.66772587810195,205.66772587810195,0.67661758487620072,{"$error":"#DIV/0!"},0.67661758487620072]
[null,null,"lug",0,1,0,2.4,0,476.4,{"$error":"#DIV/0!"},0.78401647356852311,null,{"$f":"31*24","v":744},{"$f":"+'Dettaglio mesi'!K37","v":24.4},84.49199999999999,60.091999999999992,75.599999999999994,{"$f":"IF(INTEGRAZ,fabb_risc!J36,0)*IF($R$31=TRUE,1,(Tabelle6!$C$11/100))","v":0},{"$f":"IF(ACS,cti!E25+cti!F25+cti!G25+cti!H25+cti!I25,0)","v":314.09665000000001},314.09665000000001,{"$error":"#DIV/0!"},0.88822071104570666,188239.17647902679,{"$f":"+'UNI8477'!K18","v":188.23917647902678},{"$error":"#DIV/0!"},0.98813137350754721,{"$error":"#DIV/0!"},233.05894809271419,0,233.05894809271419,233.05894809271419,0.74199756060026167,{"$error":"#DIV/0!"},0.74199756060026167]
[null,null,"ago",0,1,0,2.4,0,476.4,{"$error":"#DIV/0!"},0.78401647356852311,null,{"$f":"31*24","v":744},{"$f":"+'Dettaglio mesi'!L37","v":24.3},84.623999999999995,60.323999999999998,75.7,{"$f":"IF(INTEGRAZ,fabb_risc!K36,0)*IF($R$31=TRUE,1,(Tabelle6!$C$11/100))","v":0},{"$f":"IF(ACS,cti!E26+cti!F26+cti!G26+cti!H26+cti!I26,0)","v":314.09665000000001},314.09665000000001,{"$error":"#DIV/0!"},0.8916499063622646,185908.43785212742,{"$f":"+'UNI8477'!L18","v":185.90843785212741},{"$error":"#DIV/0!"},0.97589653481050387,{"$error":"#DIV/0!"},230.6481488870127,0,230.6481488870127,230.6481488870127,0.73432221861332392,{"$error":"#DIV/0!"},0.73432221861332392]
[null,null,"set",0,1,0,2.4,0,476.4,{"$error":"#DIV/0!"},0.78401647356852311,null,{"$f":"30*24","v":720},{"$f":"+'Dettaglio mesi'!M37","v":21.1},88.847999999999985,67.74799999999999,78.900000000000006,{"$f":"IF(INTEGRAZ,fabb_risc!L36,0)*IF($R$31=TRUE,1,(Tabelle6!$C$11/100))","v":0},{"$f":"IF(ACS,cti!E27+cti!F27+cti!G27+cti!H27+cti!I27,0)","v":303.96450000000004},303.96450000000004,{"$error":"#DIV/0!"},1.0013841564921209,157737.48011111945,{"$f":"+'UNI8477'!M18","v":157.73748011111945},{"$error":"#DIV/0!"},0.85561819622756519,{"$error":"#DIV/0!"},197.9578426728805,0,197.9578426728805,197.9578426728805,0.6512531650007829,{"$error":"#DIV/0!"},0.6512531650007829]
[null,null,"ott",0.39909943257258046,0.6009005674274196,0.95783863817419301,1.4421613618258069,190.13096967757733,286.26903032242268,0.784016473568523,0.78401647356852311,null,{"$f":"31*24","v":744},{"$f":"+'Dettaglio mesi'!N37","v":15.8},95.843999999999994,80.043999999999997,84.2,{"$f":"IF(INTEGRAZ,fabb_risc!M36,0)*IF($R$31=TRUE,1,(Tabelle6!$C$11/100))","v":208.61320754716982},{"$f":"IF(ACS,cti!E28+cti!F28+cti!G28+cti!H28+cti!I28,0)","v":314.09665000000001},522.7098575471698,{"$f":"+IF(U14<0,0,IF(U14>18,18,U14))","v":0.74785765367067736},0.71094439466051895,126511.56865648252,{"$f":"+'UNI8477'!N18","v":126.51156865648251},0.39905938521923673,0.39905938521923667,67.878261569051958,102.92349702250959,67.878261569051958,102.92349702250959,170.80175859156157,0.32676207675335117,0.32537854322432536,0.32768097661184731]
[null,null,"nov",0.59790916550330109,0.4020908344966988,1.4349819972079225,0.96501800279207706,284.84392644577264,191.55607355422731,0.784016473568523,0.78401647356852311,null,{"$f":"30*24","v":720},{"$f":"+'Dettaglio mesi'!O37","v":10.9},102.31199999999998,91.411999999999978,89.1,{"$f":"IF(INTEGRAZ,fabb_risc!N36,0)*IF($R$31=TRUE,1,(Tabelle6!$C$11/100))","v":451.99528301886807},{"$f":"IF(ACS,cti!E29+cti!F29+cti!G29+cti!H29+cti!I29,0)","v":303.96450000000004},755.95978301886817,0.52954895421547421,0.54328988779736165,88691.485652737814,{"$f":"+'UNI8477'!O18","v":88.691485652737811},0.19344219736168713,0.19344219736168719,70.567246880095652,47.192686731601093,70.567246880095652,47.192686731601093,117.75993361169674,0.15577539474577781,0.15612385688801514,0.15525723145828241]
[null,null,"dic",0.67274924309960171,0.3272507569003984,1.6145981834390442,0.78540181656095609,320.49773941265022,155.90226058734979,0.78401647356852311,0.78401647356852311,null,{"$f":"31*24","v":744},{"$f":"+'Dettaglio mesi'!P37","v":7},107.46,100.46,93,{"$f":"IF(INTEGRAZ,fabb_risc!O36,0)*IF($R$31=TRUE,1,(Tabelle6!$C$11/100))","v":645.70754716981151},{"$f":"IF(ACS,cti!E30+cti!F30+cti!G30+cti!H30+cti!I30,0)","v":314.09665000000001},959.80419716981146,0.44985012478435632,0.48593487672942387,73061.658285401456,{"$f":"+'UNI8477'!P18","v":73.06165828540145},0.12550899708105473,0.1255089970810547,62.282302492803133,29.578849835329798,62.282302492803133,29.578849835329798,91.861152328132931,9.5708221113228339E-2,9.6455899835446418E-2,9.4171172584393364E-2]
[null,null,null,null,null,null,null,null,null,null,null,null,null,null,null,null,null,{"$f":"SUM(R35:R46)","v":3685.5000000000009},{"$f":"SUM(S35:S46)","v":3698.2347500000001},{"$f":"SUM(T35:T46)","v":7383.7347500000014},null,null,null,null,null,null,null,null,{"$f":"SUM(AC35:AC46)","v":642.71964866940323},{"$f":"SUM(AD35:AD46)","v":1424.7176243433128},2067.4372730127161,{"$f":"+SUM(AE35:AE46)/T47","v":0.27999885464638552},{"$f":"+AC47/R47","v":0.17439143906373711},{"$f":"+AD47/S47","v":0.38524261455909814}]
[null,null,null,null,null,null,null,null,null,null,null,null,null,null,null,null,null,null,null,null,"X limitate a 18",null,null,null,"Y limitate a 3"]
[]
[null,null,null,"a",1.0289999999999999]
[null,null,null,"b",-6.5000000000000002E-2]
[null,null,null,"c",-0.245]
[null,null,null,"d",1.8E-3]
[null,null,null,"e",2.1499999999999998E-2]
[null,null,null,"f",0]

{"sheet":"Tabelle","index":18,"n_rows":67,"n_cols":22,"rows_kept":67,"cut":false,"hidden":true,"merged":[]}
[null,null,null,null,null,null,null,null,"**","**"]
["Rendimento pannellli",null,"eta0","a1","a2","RADdiff","IAM (50)","TIPO","R.app.inv.","R.app.est"]
[1,"--- Scegliere tipo pannello ---",0,0,0,0,0,"CPC",0,0]
[2,"Star",0.64400000000000002,0.749,5.0000000000000001E-3,1,1,"CPC",0.5,0.61,null,null,"Ex pannelli:"]
[3,"CSO 21",0.745,2.0070000000000001,5.0000000000000001E-3,0.9,1,"CSO",0.5,0.61]
[4,"AQUA PLASMA",0.68700000000000006,0.61299999999999999,3.0000000000000001E-3,1,1,"CPC",0.5,0.61,null,null,"Rendimento pannellli",null,"eta0","a1","a2","RADdiff","IAM (50)","TIPO","R.app.inv.","R.app.est"]
[5,"EasySun PLUS",0.79378749999999998,3.7739166666666666,1.3704166666666665E-2,0.85,0.92,"PIANO",0.4,0.6,null,null,5,"EasySun II",0.80100000000000005,3.65,1.6899999999999998E-2,0.85,0.94,"PIANO",0.4,0.6]
[6]
[7]
[8]
[9]
[10]
["Scelto",{"$f":"+pannelloscelto","v":4}]
[null,{"$f":"VLOOKUP(pannelloscelto,A3:E12,2,FALSE)","v":"AQUA PLASMA"},{"$f":"VLOOKUP(pannelloscelto,A3:E12,3,FALSE)","v":0.68700000000000006},{"$f":"VLOOKUP(pannelloscelto,A3:E12,4,FALSE)","v":0.61299999999999999},{"$f":"VLOOKUP(pannelloscelto,A3:E12,5,FALSE)","v":3.0000000000000001E-3},{"$f":"VLOOKUP(pannelloscelto,A3:F12,6,FALSE)","v":1},{"$f":"VLOOKUP(pannelloscelto,A3:G12,7,FALSE)","v":1},{"$f":"VLOOKUP(pannelloscelto,A3:H12,8,FALSE)","v":"CPC"},{"$f":"VLOOKUP(pannelloscelto,A3:J12,9,FALSE)","v":0.5},{"$f":"VLOOKUP(pannelloscelto,A3:J12,10,FALSE)","v":0.61}]
["Non modificare la posizione pannelli, vedi fogli \"Dettaglio Solar o CPC\", prime celle con rendimenti"]
["usato nel folgio DETTAGLIO, riga 213"]
[]
[]
[]
["Latitudine",null,null,"L","gradi °",{"$f":"VLOOKUP(localitascelta,Tab_UNI!Z5:AG105,5,FALSE)","v":"42"}]
[null,null,null,null,"rad",{"$f":"F20/180*PI()","v":0.73303828583761843}]
["Costante solare",null,null,"Ics","W/m2",1353]
["Inclinazione del collettore b",null,null,null,"rad",{"$f":"F24/180*PI()","v":0.78539816339744828}]
[null,null,null,null,"°",{"$f":"+inclinazione","v":45},null,{"$f":"+ABS(Tabelle!F24)+ABS(Tabelle!F26)","v":50}]
["Azimut del collettore",null,null,null,"rad",{"$f":"F26/180*PI()","v":-8.7266462599716474E-2},null,{"$f":"+IF(H24>130,H26,\"\")","v":""}]
[null,null,null,null,"°",{"$f":"+azimut","v":-5},null,"Attenzione: dati di input non adatti per la simulazione. Diminuire l'inclinazione del pannello oppure l'esposizione."]
["Altitudine località",null,null,null,"m",{"$f":"VLOOKUP(localitascelta,Tab_UNI!Z5:AG105,4,FALSE)","v":154}]
[]
[]
[]
["Elenco per azimut",null,-90,null,"Inclinazione",0]
[null,null,-80,null,null,5]
[null,null,-70,null,null,10]
[null,null,-60,null,null,15]
[null,null,-50,null,null,20]
[null,null,-40,null,null,30]
[null,null,-30,null,null,45]
[null,null,-20,null,null,60]
[null,null,-15,null,null,75]
[null,null,-10,null,null,90]
[null,null,-5]
[null,null,0]
[null,null,5]
[null,null,10]
[null,null,15]
[null,null,20]
[null,null,30]
[null,null,40]
[null,null,50]
[null,null,60]
[null,null,70]
[null,null,80]
[null,null,90]
[]
[]
["Non spostare queste celle qui sotto, perché sono usate anche nel web con i riferimenti alle celle"]
[null,"Profili di utilizzo","gen","feb","mar","apr","mag","giu","lug","ago","set","ott","nov","dic"]
[1,"condominio",100,100,90,90,80,80,75,80,80,90,90,100]
[2,"casa",100,100,90,90,80,80,75,80,80,90,100,100]
[3,"uffici",100,100,100,100,90,85,80,85,90,100,100,100]
[4,"negozi",90,90,85,75,75,65,60,65,70,75,80,100]
[5,"sempre 100%",100,100,100,100,100,100,100,100,100,100,100,100]
[6,"personalizzato"]
[5,{"$f":"VLOOKUP($A$64,$A$58:$N$63,2,FALSE)","v":"sempre 100%"},{"$f":"VLOOKUP($A$64,$A$58:$N$62,3,FALSE)","v":100},{"$f":"VLOOKUP($A$64,$A$58:$N$62,4,FALSE)","v":100},{"$f":"VLOOKUP($A$64,$A$58:$N$62,5,FALSE)","v":100},{"$f":"VLOOKUP($A$64,$A$58:$N$62,6,FALSE)","v":100},{"$f":"VLOOKUP($A$64,$A$58:$N$62,7,FALSE)","v":100},{"$f":"VLOOKUP($A$64,$A$58:$N$62,8,FALSE)","v":100},{"$f":"VLOOKUP($A$64,$A$58:$N$62,9,FALSE)","v":100},{"$f":"VLOOKUP($A$64,$A$58:$N$62,10,FALSE)","v":100},{"$f":"VLOOKUP($A$64,$A$58:$N$62,11,FALSE)","v":100},{"$f":"VLOOKUP($A$64,$A$58:$N$62,12,FALSE)","v":100},{"$f":"VLOOKUP($A$64,$A$58:$N$62,13,FALSE)","v":100},{"$f":"VLOOKUP($A$64,$A$58:$N$62,14,FALSE)","v":100}]
[]
[]
[null,{"$f":"+IF(A64=6,TRUE,FALSE)","v":false}]

{"sheet":"Tabelle5","index":19,"n_rows":56,"n_cols":20,"rows_kept":56,"cut":false,"hidden":true,"merged":[]}
[null,"Tipo","UnitàMisura","Litri",null,"litri * UM",null,null,null,"testo nel foglio FABB ACS"]
[0,"abitazione S < 35 m2","m2",{"$f":"+ROUND(F2/unita_misura,2)","v":0.63},"litri/G m2",{"$f":"+(0*unita_misura+50)*num_alloggi","v":50},null,null,null,{"$f":"\"m2/alloggio\"&\" (\"&num_alloggi&\" alloggi)\"","v":"m2/alloggio (1 alloggi)"},null,null,1,"Abitazioni",{"$f":"+IF(tipologia_sanitario=1,TRUE,FALSE)","v":true},null,null,"si",true,"elenco possibilità di casella scelta in parasol web"]
[1,"abitazione 35 < S < 50 m2","m2",{"$f":"+ROUND(F3/unita_misura,2)","v":2.13},"litri/G m2",{"$f":"+(2.667*unita_misura-43.33)*num_alloggi","v":170.02999999999997},1,"numero alloggi",null,{"$f":"\"m2/alloggio\"&\" (\"&num_alloggi&\" alloggi)\"","v":"m2/alloggio (1 alloggi)"},null,null,2,"Altri utilizzi",{"$f":"+IF(tipologia_sanitario=2,TRUE,FALSE)","v":false},null,null,"no",false]
[2,"abitazione 50 < S < 200 m2","m2",{"$f":"+ROUND(F4/unita_misura,2)","v":1.53},"litri/G m2",{"$f":"+(1.067*unita_misura+36.67)*num_alloggi","v":122.03},null,null,null,{"$f":"\"m2/alloggio\"&\" (\"&num_alloggi&\" alloggi)\"","v":"m2/alloggio (1 alloggi)"},null,null,1]
[3,"abitazione S > 200 m2","m2",{"$f":"+ROUND(F5/unita_misura,2)","v":3.13},"litri/G m2",{"$f":"+(0*unita_misura+250)*num_alloggi","v":250},null,null,null,{"$f":"\"m2/alloggio\"&\" (\"&num_alloggi&\" alloggi)\"","v":"m2/alloggio (1 alloggi)"}]
[4,null,null,null,null,{"$f":"+D6*unita_misura","v":0}]
[5,"Dormitori, residence, B&B","letti",40,"litri/G per letto",3200,null,null,null,"letti",null,null,{"$f":"+B7&\" - \"&D7&\" \"&E7&\" - inserire \"&C7","v":"Dormitori, residence, B&B - 40 litri/G per letto - inserire letti"},null,null,null,null,null,false,"usato in web per non visualizzare una domanda"]
[6,"Hotel fino a 3 stelle","letti",60,"litri/G per letto",4800,null,null,null,"letti",null,null,{"$f":"+B8&\" - \"&D8&\" \"&E8&\" - inserire \"&C8","v":"Hotel fino a 3 stelle - 60 litri/G per letto - inserire letti"}]
[7,"Hotel 4 stelle","letti",80,"litri/G per letto",6400,null,null,null,"letti",null,null,{"$f":"+B9&\" - \"&D9&\" \"&E9&\" - inserire \"&C9","v":"Hotel 4 stelle - 80 litri/G per letto - inserire letti"}]
[8,"Ospedale day hospital","letti",10,"litri/G per letto",800,null,null,null,"letti",null,null,{"$f":"+B10&\" - \"&D10&\" \"&E10&\" - inserire \"&C10","v":"Ospedale day hospital - 10 litri/G per letto - inserire letti"}]
[9,"Ospedale con pernottamento","letti",90,"litri/G per letto",7200,null,null,null,"letti",null,null,{"$f":"+B11&\" - \"&D11&\" \"&E11&\" - inserire \"&C11","v":"Ospedale con pernottamento - 90 litri/G per letto - inserire letti"}]
[10,"Scuole e istruzione","alunni",0.2,"litri/G per alunno",16,null,null,null,"alunni",null,null,{"$f":"+B12&\" - \"&D12&\" \"&E12&\" - inserire \"&C12","v":"Scuole e istruzione - 0,2 litri/G per alunno - inserire alunni"}]
[11,"Scuole materne e asili nido","bambini",8,"litri/G per bambino",640,null,null,null,"bambini",null,null,{"$f":"+B13&\" - \"&D13&\" \"&E13&\" - inserire \"&C13","v":"Scuole materne e asili nido - 8 litri/G per bambino - inserire bambini"}]
[12,"Attività sportive / palestre","docce installate",50,"litri/G doccia installata",4000,null,null,null,"docce",null,null,{"$f":"+B14&\" - \"&D14&\" \"&E14&\" - inserire \"&C14","v":"Attività sportive / palestre - 50 litri/G doccia installata - inserire docce installate"}]
[13,"Spogliatori di stabilimenti","docce installate",10,"litri/G doccia installata",800,null,null,null,"docce",null,null,{"$f":"+B15&\" - \"&D15&\" \"&E15&\" - inserire \"&C15","v":"Spogliatori di stabilimenti - 10 litri/G doccia installata - inserire docce installate"}]
[14,"Uffici","m2",0.2,"litri/G m2",16,null,null,null,"m2",null,null,{"$f":"+B16&\" - \"&D16&\" \"&E16&\" - inserire \"&C16","v":"Uffici - 0,2 litri/G m2 - inserire m2"}]
[15,"Esercizio commerciale con servizi igienici","m2",0.2,"litri/G m2",16,null,null,null,"m2",null,null,"Esercizio commerciale con servizi igienici - 0,2 litri/G m2 - inserire m2"]
[16,"Ristoranti","coperti",65,"litri/G coperto",5200,null,null,null,"coperti",null,null,"Ristoranti - 65 litri/G coperto - inserire coperti"]
[17,"Catering, self service, bar","coperti",25,"litri/G coperto",2000,null,null,null,"coperti",null,null,"Catering, self service, bar - 25 litri/G coperto - inserire coperti"]
[18,"Servizio lavanderia","letti",50,"litri/G per letto",4000,null,null,null,"letti",null,null,"Servizio lavanderia - 50 litri/G per letto - inserire letti"]
[19,"Centri benessere","ospiti",200,"litri/G per ospite",16000,null,null,null,"ospiti",null,null,"Centri benessere - 200 litri/G per ospite - inserire ospiti"]
[20,null,null,null,null,0]
[21,"ALTRO UTILIZZO","litri/giorno",1,"litri/giorno",80,null,null,null,"litri/giorno",null,null,{"$f":"+B23&\" - \"&\" - inserire \"&C23","v":"ALTRO UTILIZZO -  - inserire litri/giorno"}]
[22,null,null,null,null,0]
[23,null,null,null,null,0]
[24,null,null,null,null,0]
[25,null,null,null,null,0]
[{"$f":"+acs_scelto","v":3},{"$f":"VLOOKUP(variabili!C29,A2:D27,2,FALSE)","v":"abitazione S > 200 m2"},{"$f":"VLOOKUP(acs_scelto,A2:D27,3,FALSE)","v":"m2"},{"$f":"VLOOKUP(acs_scelto,A2:D27,4,FALSE)","v":3.13},{"$f":"VLOOKUP(acs_scelto,A2:E27,5,FALSE)","v":"litri/G m2"},{"$f":"VLOOKUP(acs_scelto,A2:F27,6,FALSE)","v":250},80,"NO",null,{"$f":"VLOOKUP(variabili!C29,A2:J27,10,FALSE)","v":"m2/alloggio (1 alloggi)"}]
[null,null,null,null,null,"litri * UM","UM"]
[]
[null,"K tubo",0.4]
[null,"Tamb.",18.4583333333333,"dato fisso!"]
[null,"Tdistrib.",48,"dato fisso!"]
[null,"Lunghezza ricircolo",10,null,null,null,"Valore da usare:",{"$f":"+F28","v":250},"litri/giorno"]
[null,"Ore ricircolo",6]
[null,"Ricircolo",true,"Fabbisogno giornaliero per ricircolo:",null,null,{"$f":"k_ricircolo*lung_ricircolo*(tdistrib_ricircolo-tamb_ricircolo)*ore_ricircolo","v":709.0000000000008},"Wh al giorno"]
[null,null,null,"Fabbisogno per ricircolo da usare:",null,null,{"$f":"+G36*C36","v":709.0000000000008},"Wh"]
[null,"temperature utilizzo",{"$f":"+fabb_ACS!L5","v":40},null,"Energia necessaria"]
[null,"temperature entrata",{"$f":"+ROUND(AVERAGE('UNI8477'!E20:P20),0)","v":15},"est",{"$f":"H34*(C38-C39)*4186/3600/1000","v":7.2673611111111116},"kWh",{"$f":"+'UNI8477'!E20","v":5.5}]
[null,null,{"$f":"+C39","v":15},"inv.",{"$f":"H34*(C38-C40)*4186/3600/1000","v":7.2673611111111116},"kWh"]
[null,null,{"$f":"+C40&\"°C / \"&tcalda&\"°C\"","v":"15°C / 40°C"},"testoweb3"]
[]
[null,"Energia","gg","%",null,null,"en/gg","ricircolo","litri/giorno"]
[null,"gen",31,{"$f":"+fabb_ACS!C14","v":100},{"$f":"+D44*C44*$E$40/100","v":225.28819444444446},"kWh",{"$f":"E44/C44","v":7.2673611111111116},{"$f":"+$G$37/1000*C44*D44/100","v":21.979000000000024},{"$f":"+$H$34*D44/100","v":250}]
[null,"feb",28,{"$f":"+fabb_ACS!D14","v":100},{"$f":"+D45*C45*$E$40/100","v":203.48611111111114},"kWh",{"$f":"E45/C45","v":7.2673611111111125},{"$f":"+$G$37/1000*C45*D45/100","v":19.852000000000022},{"$f":"+$H$34*D45/100","v":250}]
[null,"mar",31,{"$f":"+fabb_ACS!E14","v":100},{"$f":"+D46*C46*$E$40/100","v":225.28819444444446},"kWh",7.2673611111111116,21.979000000000024,250]
[null,"apr",30,{"$f":"+fabb_ACS!F14","v":100},{"$f":"+D47*C47*$E$39/100","v":218.02083333333337},"kWh",7.2673611111111125,21.270000000000024,250]
[null,"mag",31,{"$f":"+fabb_ACS!G14","v":100},225.28819444444446,"kWh",7.2673611111111116,21.979000000000024,250]
[null,"giu",30,{"$f":"+fabb_ACS!H14","v":100},{"$f":"+D49*C49*$E$39/100","v":218.02083333333337},"kWh",7.2673611111111125,21.270000000000024,250]
[null,"lug",31,{"$f":"+fabb_ACS!I14","v":100},225.28819444444446,"kWh",7.2673611111111116,21.979000000000024,250]
[null,"ago",31,{"$f":"+fabb_ACS!J14","v":100},225.28819444444446,"kWh",7.2673611111111116,21.979000000000024,250]
[null,"set",30,{"$f":"+fabb_ACS!K14","v":100},218.02083333333337,"kWh",7.2673611111111125,21.270000000000024,250]
[null,"ott",31,{"$f":"+fabb_ACS!L14","v":100},{"$f":"+D53*C53*$E$40/100","v":225.28819444444446},"kWh",7.2673611111111116,21.979000000000024,250]
[null,"nov",30,{"$f":"+fabb_ACS!M14","v":100},{"$f":"+D54*C54*$E$40/100","v":218.02083333333337},"kWh",7.2673611111111125,21.270000000000024,250]
[null,"dic",31,{"$f":"+fabb_ACS!N14","v":100},{"$f":"+D55*C55*$E$40/100","v":225.28819444444446},"kWh",7.2673611111111116,21.979000000000024,{"$f":"+$H$34*D55/100","v":250}]
[null,null,null,null,null,null,null,{"$f":"SUM(H44:H55)","v":258.78500000000025}]

{"sheet":"Tabelle6","index":20,"n_rows":73,"n_cols":16,"rows_kept":73,"cut":false,"hidden":true,"merged":[]}
["verificato"]
[null,null,null,null,null,null,null,null,null,null,null,"Fattore conversione in energia primaia"]
[null,"Tipo","Rend.","Rend. ACS","Combust.","prezzo",null,null,"potere",null,"kg CO2 su unità","fp tot","€/kWh","fp nren","fp ren","PDC?"]
[1,"Caldaia a condens. 4*",91,90,"metano",0.85,"€ / m3","m3 di metano",9500,"Wh/m3",1.97,1.05,{"$f":"+F4/I4*1000","v":8.9473684210526316E-2},1.05,0,false]
[2,"Caldaia 3*",87,86,"metano",0.85,"€ / m3","m3 di metano",9500,"Wh/m3",1.97,1.05,8.9473684210526316E-2,1.05,0,false]
[3,"Pompa di calore aria-acqua",390,210,"elettricità",0.2,"€ / kWh el","kWh el",1000,"Wh/kWh el",0.41,2.42,0.2,1.95,0.47,true]
[4,"Caldaia a gasolio, monostadio",85,80,"gasolio",1.25,"€ / litro","litri di gasolio",9800,"Wh/litro",2.66,1.07,0.12755102040816327,1.07,0,false]
[5,"Caldaia a GPL",85,80,"gpl",1.1499999999999999,"€ / litro","litri di GPL",6900,"Wh/litro",1.73,1.05,0.16666666666666666,1.05,0,false]
[6,"Caldaia a pellet",85,85,"pellet",0.2,"€ / kg","kilogrammi di pellet",4800,"Wh/kilogr.",0,1,4.1666666666666671E-2,0.2,0.8,false]
[1,{"$f":"VLOOKUP(A10,A4:D9,2,FALSE)","v":"Caldaia a condens. 4*"},{"$f":"VLOOKUP(A10,A4:D9,3,FALSE)","v":91},{"$f":"VLOOKUP(A10,A4:D9,4,FALSE)","v":90},{"$f":"VLOOKUP(A10,A4:E9,5,FALSE)","v":"metano"},{"$f":"VLOOKUP(A10,A4:F9,6,FALSE)","v":0.85},{"$f":"VLOOKUP(A10,A4:G9,7,FALSE)","v":"€ / m3"},"proposte dal programma",{"$f":"VLOOKUP(A10,A4:I9,9,FALSE)","v":9500},null,{"$f":"VLOOKUP(A10,A4:K9,11,FALSE)","v":1.97},{"$f":"VLOOKUP(A10,A4:L9,12,FALSE)","v":1.05},null,{"$f":"VLOOKUP(A10,A4:O9,14,FALSE)","v":1.05},{"$f":"VLOOKUP(A10,A4:O9,15,FALSE)","v":0},{"$f":"VLOOKUP(A10,A4:P9,16,FALSE)","v":false}]
[null,"Inserito",91,90,null,"0,85",null,"usate nel calcolo: inserite dall'utente oppure proposte dal programma"," "]
[]
["tasso","tasso"]
["proposto","inserito"]
[4,4,null,null,null,null,null,null,null,null,"per COP acs da usare nel foglio \"cti\", l'utente inserisce il COPN a 55/7"]
[null,null,null,null,null,null,null,null,null,null,"con questi coefficienti (tratti dalle nostre pdc) si trasfroma questo COP alle altre temperature esterne"]
[null,null,null,null,null,null,null,null,null,null,"t.ext","coeff","COPN(t.ext)"]
[null,"energia ACS",{"$f":"+riepilogo!J21","v":1424.7176243433128},"kWh / anno",{"$f":"+C18*1000/I10/(cti!E16)","v":166.63364027407167},null,null,null,null,null,-15,0.5243822690899218,{"$f":"+L18*$D$11","v":47.194404218092963}]
[null,"energia RISC+PISC",{"$f":"+riepilogo!L21","v":642.71964866940323},"kWh / anno",{"$f":"+C19*1000/I10/(cti!E57)","v":74.345824021908982},null,"CO2 kg",null,null,null,-14,0.53650225835326881,{"$f":"+L19*$D$11","v":48.285203251794194}]
[null,null,null,null,{"$f":"ROUND(SUM(E18:E19),0)","v":241},{"$f":"VLOOKUP(A10,A4:H9,8,FALSE)","v":"m3 di metano"},{"$f":"+comb_evitato*K10","v":474.77},null,null,null,-13,0.54903096798372464,49.412787118535221]
[null,null,null,null,{"$f":"+E20*F11","v":204.85},"euro",null,null,null,null,-12,0.56196123490947403,50.576511141852663]
[null,null,null,null,null,null,null,null,null,null,-11,0.57528756269131631,51.775880642218468]
[null,null,null,null,null,null,null,null,null,null,-10,0.58856787388196685,52.971108649377015]
[null,"potenza caldaia per poduzione acs",9,"kW",null,null,null,null,null,null,-9,0.60189585312712324,54.170626781441094]
[null,null,null,null,null,null,null,null,null,null,-8,0.61507896421282338,55.357106779154101]
[null,null,null,null,null,null,null,null,null,null,-7,0.63123038176432766,56.810734358789489]
[null,null,null,null,null,null,null,null,null,null,-6,0.64261148251662426,57.835033426496182]
[null,null,null,null,null,null,null,null,null,null,-5,0.65698208341661968,59.128387507495773]
[null,null,null,null,null,null,null,null,null,null,-4,0.67123997710063432,60.411597939057089]
[null,null,null,null,null,null,null,null,null,null,-3,0.70136596456749878,63.122936811074894]
[null,null,null,null,null,null,null,null,null,null,-2,0.7314433370306811,65.829900332761298]
[null,null,null,null,null,null,null,null,null,null,-1,0.7614723900288245,68.532515102594203]
[null,null,null,null,null,null,null,null,null,null,0,0.7914534167099001,71.230807503891015]
[null,null,null,null,null,null,null,null,null,null,1,0.82138670785532997,73.924803706979702]
[null,null,null,null,null,null,null,null,null,null,2,0.85127255190382167,76.614529671343945]
[null,null,null,null,null,null,null,null,null,null,3,0.88111123497491339,79.300011147742211]
[null,null,null,null,null,null,null,null,null,null,4,0.91090304089223562,81.9812736803012]
[null,null,null,null,null,null,null,null,null,null,5,0.94064825120649476,84.658342608584533]
[null,null,null,null,null,null,null,null,null,null,6,0.97034714521818022,87.331243069636216]
[null,null,null,null,null,null,null,null,null,null,7,1,90]
[null,null,null,null,null,null,null,null,null,null,8,1.0391361180567116,93.522250625104036]
[null,null,null,null,null,null,null,null,null,null,9,1.080008470445208,97.200762340068721]
[null,null,null,null,null,null,null,null,null,null,10,1.1226603241498716,101.03942917348844]
[null,null,null,null,null,null,null,null,null,null,11,1.1671138785812942,105.04024907231648]
[null,null,null,null,null,null,null,null,null,null,12,1.2133930922878433,109.2053783059059]
[null,null,null,null,null,null,null,null,null,null,13,1.2615238065476593,113.53714258928933]
[null,null,null,null,null,null,null,null,null,null,14,1.3115338834933699,118.03804951440328]
[null,null,null,null,null,null,null,null,null,null,15,1.3634533603152053,122.71080242836847]
[null,null,null,null,null,null,null,null,null,null,16,1.4173146213282617,127.55831591954355]
[null,null,null,null,null,null,null,null,null,null,17,1.4731525899651874,132.58373309686687]
[null,null,null,null,null,null,null,null,null,null,18,1.5310049430732822,137.79044487659539]
[null,null,null,null,null,null,null,null,null,null,19,1.5909123502632458,143.18211152369213]
[null,null,null,null,null,null,null,null,null,null,20,1.6529187414852864,148.76268673367576]
[null,null,null,null,null,null,null,null,null,null,21,1.7170716065089109,154.53644458580197]
[null,null,null,null,null,null,null,null,null,null,22,1.7834223305698238,160.50800975128413]
[null,null,null,null,null,null,null,null,null,null,23,1.8520265711383683,166.68239140245316]
[null,null,null,null,null,null,null,null,null,null,24,1.9229446815802635,173.06502134222373]
[null,null,null,null,null,null,null,null,null,null,25,1.9962421884481387,179.66179696033248]
[null,null,null,null,null,null,null,null,null,null,26,2.0719903302938705,186.47912972644835]
[null,null,null,null,null,null,null,null,null,null,27,2.1502666672669095,193.52400005402185]
[null,null,null,null,null,null,null,null,null,null,28,2.2311557724123077,200.80401951710769]
[null,null,null,null,null,null,null,null,null,null,29,2.3147500175660296,208.32750158094265]
[null,null,null,null,null,null,null,null,null,null,30,2.4011504691422454,216.10354222280208]
[null,null,null,null,null,null,null,null,null,null,31,2.4904679120156215,224.14211208140594]
[null,null,null,null,null,null,null,null,null,null,32,2.5828240232457476,232.45416209211729]
[null,null,null,null,null,null,null,null,null,null,33,2.6783527217288503,241.05174495559652]
[null,null,null,null,null,null,null,null,null,null,34,2.7772017251970866,249.9481552677378]
[null,null,null,null,null,null,null,null,null,null,35,2.8795343525791539,259.15809173212386]
[null,null,null,null,null,null,null,null,null,null,36,2.985531617926676,268.69784561340083]
[null,null,null,null,null,null,null,null,null,null,37,3.0953946723407952,278.58552051067159]
[null,null,null,null,null,null,null,null,null,null,38,3.2093476631827542,288.84128968644791]
[null,null,null,null,null,null,null,null,null,null,39,3.3276410960885117,299.48769864796606]
[null,null,null,null,null,null,null,null,null,null,40,3.4505558059521113,310.55002253569]

{"sheet":"CT20","index":21,"n_rows":25,"n_cols":18,"rows_kept":25,"cut":false,"hidden":true,"merged":[[0,3,0,4],[0,5,0,6],[0,7,0,8],[8,2,8,6]]}
[null,null,"Ag","Qcol (kWh)",null,"Qu (kWh/m2)",null,"Sl",null,"Qu * Sl (kWh)"]
[null,null,"Sup lorda m2","50°C","75°C","50°C","75°C","nr","m2","50°C","75°C",null,null,null,null,"Dal foglio \"Tabelle\""]
[1,"STAR 15/39",3.93,2313,1997,{"$f":"D3/C3","v":588.54961832061065},{"$f":"E3/C3","v":508.1424936386768},{"$f":"+superficie/L3","v":0.68571428571428572},{"$f":"H3*C3","v":2.6948571428571428},{"$f":"+I3*F3","v":1586.0571428571427},{"$f":"+I3*G3","v":1369.3714285714284},3.5,null,null,null,1,"Star"]
[2,"CSO21",2.38,1201,1004,{"$f":"D4/C4","v":504.62184873949582},{"$f":"E4/C4","v":421.84873949579833},{"$f":"+superficie/L4","v":1.8045112781954886},{"$f":"H4*C4","v":4.2947368421052623},{"$f":"+I4*F4","v":2167.2180451127815},{"$f":"+I4*G4","v":1811.7293233082703},1.33,null,null,null,2,"CSO 21"]
[3,"PLASMA 15/40",3.99,2568,2316,{"$f":"D5/C5","v":643.60902255639098},{"$f":"E5/C5","v":580.45112781954879},{"$f":"+superficie/L5","v":0.68571428571428572},{"$f":"H5*C5","v":2.7360000000000002},{"$f":"+I5*F5","v":1760.9142857142858},{"$f":"+I5*G5","v":1588.1142857142856},3.5,null,null,null,3,"AQUA PLASMA"]
[4,"EasySun II",2.15,938,544,{"$f":"D6/C6","v":436.27906976744185},{"$f":"E6/C6","v":253.02325581395351},{"$f":"+superficie/L6","v":1.2},{"$f":"H6*C6","v":2.5799999999999996},{"$f":"+I6*F6","v":1125.5999999999999},{"$f":"+I6*G6","v":652.79999999999995},2,null,null,null,4,"EasySun II"]
[{"$f":"+pannelloscelto","v":4},null,null,null,null,null,null,null,{"$f":"+VLOOKUP(A7,A3:I6,9,FALSE)","v":2.5799999999999996},{"$f":"+VLOOKUP(A7,A3:K6,10,FALSE)","v":1125.5999999999999},{"$f":"+VLOOKUP(A7,A3:K6,11,FALSE)","v":652.79999999999995},null,null,null,null,{"$f":"+pannelloscelto","v":4},null,"pannello scelto"]
[]
[null,null,"superficie lorda",null,null,null,null,null,null,null,null,null,null,null,null,"Dal foglio \"Incentivi\""]
[null,"Ci     incentivo annuo €/kWh","fino a 12","da 12,1 a 50","da 50,1 a 200","da 200,1 a 500","oltre 500",null,null,null,null,null,null,null,null,1,"Detrazioni fiscali per efficienza energetica (65%)"]
[null,"Per ACS  @50°C",0.35,0.32,0.1,0.09,0.08,null,null,null,null,null,null,null,null,2,"Detrazioni fiscali per ristrutturazione (50%)"]
[null,"Per ACS, Risc @50°C",0.36,0.33,0.11,0.1,0.09,null,null,null,null,null,null,null,null,3,"Conto energia 2.0 per ACS"]
[null,"Per Processo BT, TLR @75°C",0.36,0.33,0.11,0.1,0.09,null,null,null,null,null,null,null,null,4,"Conto energia 2.0 per ACS, riscaldamento"]
[null,"Per Solar Cooling @75°C",0.43,0.39,0.13,0.12,0.11,null,null,null,null,null,null,null,null,5,"Conto energia 2.0 per calore di processo"]
[null,null,null,null,null,null,null,null,null,null,null,null,null,null,null,6,"Conto energia 2.0 per solar cooling"]
[null,null,null,null,"incentivo annuo totale",null,null,null,null,null,null,null,null,null,null,7,"Altro"]
[null,null,null,"Ci","Qu","Ia tot",null,null,null,null,null,null,null,null,null,{"$f":"+incentivi!C11","v":3},null,"incentivo scelto"]
[null,1,"Per ACS ",{"$f":"+IF($I$7<=12,C11,IF($I$7<=50,D11,IF($I$7<=200,E11,IF($I$7<=500,F11,G11))))","v":0.35},{"$f":"+J7","v":1125.5999999999999}]
[null,2,"Per ACS e riscaldamento",{"$f":"+IF($I$7<=12,C12,IF($I$7<=50,D12,IF($I$7<=200,E12,IF($I$7<=500,F12,G12))))","v":0.36},{"$f":"+J7","v":1125.5999999999999}]
[null,3,"Per calore processo BT",{"$f":"+IF($I$7<=12,C13,IF($I$7<=50,D13,IF($I$7<=200,E13,IF($I$7<=500,F13,G13))))","v":0.36},{"$f":"+K7","v":652.79999999999995}]
[null,4,"Per Solar Cooling",{"$f":"+IF($I$7<=12,C14,IF($I$7<=50,D14,IF($I$7<=200,E14,IF($I$7<=500,F14,G14))))","v":0.43},{"$f":"+K7","v":652.79999999999995}]
[null,{"$f":"+P17-2","v":1},{"$f":"+VLOOKUP(B22,B18:C21,2,FALSE)","v":"Per ACS "},{"$f":"+VLOOKUP(B22,B18:D21,3,FALSE)","v":0.35},{"$f":"+VLOOKUP(B22,B18:E21,4,FALSE)","v":1125.5999999999999},{"$f":"+E22*D22","v":393.95999999999992}]
[]
[null,null,null,"Numero rate:",{"$f":"+IF(I7<=50,2,5)","v":2}]
[null,null,null,"Incentivo totale",{"$f":"+E24*F22","v":787.91999999999985}]

{"sheet":"tab_bollitore","index":22,"n_rows":60,"n_cols":11,"rows_kept":60,"cut":false,"hidden":true,"merged":[]}
[]
[]
[null,null,"V (litri)","K (W/K)","Vbu/Vnom",null,"Vbu"]
[0,"Aqua 200",216,1.22,{"$f":"+G4/C4","v":0.32870370370370372},null,71]
[1,"Aqua 300",310,1.47,{"$f":"+G5/C5","v":0.41935483870967744},null,130]
[2,"Aqua 400",428,1.56,{"$f":"+G6/C6","v":0.39018691588785048},null,167]
[3,"Aqua 500",543,1.64,{"$f":"+G7/C7","v":0.40883977900552487},null,222]
[4,"AquaSunPlus 200",212,1.49,{"$f":"+G8/C8","v":0.44811320754716982},null,95]
[5,"AquaSunPlus 300",297,1.82,0.39393939393939392,null,117]
[6,"AquaSunPlus 400",419,2.13,0.36515513126491644,null,153]
[7,"AquaSunPlus 500",513,2.27,0.42495126705653019,null,218]
[8,"AquaSunPlus 900",885,2.69,0.51864406779661021,null,459]
[9,"AquaSun 1500",1494,3.11,0.46251673360107093,null,691]
[10,"AquaSun 2000",2013,3.64,0.46696472925981125,null,940]
[11,"AquaSun 300 A",297,1.07,{"$f":"+G15/C15","v":0.29966329966329969},null,89]
[12]
[13,"AquaSun PDC 300",299,1.93,{"$f":"+G17/C17","v":1},null,299]
[14,"AquaSun PDC 500",509,2.56,{"$f":"+G18/C18","v":1},null,509]
[15,"AquaSun PDC 900",883,2.73,{"$f":"+G19/C19","v":1},null,883]
[16,"RLH 300 B",315,1.42,{"$f":"+G20/C20","v":0.92698412698412702},null,292]
[17,"RLH 500 B",465,1.6,{"$f":"+G21/C21","v":0.91827956989247317},null,427]
[18]
[19,"Bollitore SR 500",496,2.38,{"$f":"+G23/C23","v":0.98185483870967738},null,487]
[20,"Bollitore SR 1000",910,3.13,{"$f":"+G24/C24","v":0.98241758241758237},null,894]
[21,"Bollitore SR 1500",1526,3.8,{"$f":"+G25/C25","v":0.9370904325032765},null,1430]
[22]
[23,"Aqua Expresso III 500",500,1.82,{"$f":"+G27/C27","v":0.60399999999999998},null,302]
[24,"Aqua Expresso III 650",636,2,{"$f":"+G28/C28","v":0.50943396226415094},null,324]
[25,"Aqua Expresso III 800",815,2.1800000000000002,{"$f":"+G29/C29","v":0.50920245398773001},null,415]
[26,"Aqua Expresso III 1000",1047,2.38,{"$f":"+G30/C30","v":0.46800382043935052},null,490]
[27,"Aqua Expresso III 800 HF",805,2.1800000000000002,{"$f":"+G31/C31","v":0.71055900621118018},null,572]
[28]
[29,"Titan 400 Aqua",394,2.29,{"$f":"+G33/C33","v":0.64213197969543145},null,253]
[30,"Titan 400",394,2.33,{"$f":"+G34/C34","v":0.64213197969543145},null,253]
[31]
[32,"R / RR 500",512,2.31,{"$f":"+G36/C36","v":0.525390625},null,269]
[33,"R / RR 750",772,2.87,{"$f":"+G37/C37","v":0.55699481865284972},null,430]
[34,"R / RR 1000",926,3.16,{"$f":"+G38/C38","v":0.52915766738660908},null,490]
[35,"R / RR 1500",1526,3.8,{"$f":"+G39/C39","v":0.55635648754914813},null,849]
[36]
[37,"Accumulo P / PR 500",512,2.31,{"$f":"+G41/C41","v":0.525390625},null,269]
[38,"Accumulo P / PR 800",772,2.87,{"$f":"+G42/C42","v":0.55699481865284972},null,430]
[39,"Accumulo P / PR 1000",926,3.16,{"$f":"+G43/C43","v":0.52915766738660908},null,490]
[40,"Accumulo P / PR 1500",1526,3.8,{"$f":"+G44/C44","v":0.55635648754914813},null,849]
[41]
[42,"PS 1500",1489,3.78,{"$f":"+G46/C46","v":0.70382807253190061},null,1048,{"$f":"+G46/C46","v":0.70382807253190061}]
[43,"PS 2000",2015,4.2,0.70299999999999996,null,{"$f":"0.703*C47","v":1416.5449999999998}]
[44,"PS 3000",3000,4.5999999999999996,0.70299999999999996,null,2109]
[45,"PS 4000",4000,5.3,0.70299999999999996,null,2812]
[46,"PS 5000",5000,6.3,0.70299999999999996,null,3515]
[47,"PS 6000",6000,6.7,0.70299999999999996,null,4218]
[48,"PS 7000",7000,7.1,0.70299999999999996,null,4921]
[49,"PS 8000",8000,7.5,0.70299999999999996,null,5624]
[50]
[51,"Bollitore Libravario Aqua",178,1.33,{"$f":"+G55/C55","v":0.6179775280898876},null,110]
[52]
[]
[{"$f":"+numbollscelto","v":3},{"$f":"VLOOKUP(numbollscelto,A4:D56,2,FALSE)","v":"Aqua 500"},{"$f":"VLOOKUP(numbollscelto,A4:D56,3,FALSE)","v":543},{"$f":"VLOOKUP(numbollscelto,A4:D56,4,FALSE)","v":1.64},{"$f":"+numerobollitori","v":1},{"$f":"numerobollitori*C58","v":543},{"$f":"+sceltobollitore","v":false},{"$f":"+volumeinseritoboll","v":1500},{"$f":"+IF(sceltobollitore=FALSE,F58,volumeinseritoboll*numerobollitori)","v":543},{"$f":"+IF(sceltobollitore=FALSE,D58,k_bollitore)","v":1.64},{"$f":"+IF(sceltobollitore=FALSE,B58,\"Altro bollitore\")","v":"Aqua 500"}]
[null,null,"Vbu/Vnom",{"$f":"VLOOKUP(numbollscelto,A4:E56,5,FALSE)","v":0.40883977900552487},"numero","volume","altro","volume","volume","K","descrizione"]
[null,null,null,null,"bollitori",null,null,"inserito","da usare","da usare","da usare"]

{"sheet":"Tab_UNI","index":23,"n_rows":105,"n_cols":77,"rows_kept":105,"cut":false,"hidden":true,"merged":[[1,48,1,49],[1,58,1,59],[1,60,1,61],[1,50,1,51],[1,52,1,53],[1,54,1,55],[1,56,1,57],[2,25,3,25],[2,27,3,27],[2,29,2,30],[2,31,2,32],[1,46,1,47],[1,42,1,43],[1,44,1,45],[2,35,3,35],[2,37,3,37],[1,38,1,39],[1,40,1,41],[0,0,0,15],[0,17,0,23],[2,17,3,17],[2,19,3,19],[2,0,3,0],[2,2,3,2]]}
["Prospetto VI - Valori medi mensili della temperatura media giornaliera dell'aria esterna",null,null,null,null,null,null,null,null,null,null,null,null,null,null,null,null,"Prospetto XIV - Velocità giornaliera del vento - Media annuale",null,null,null,null,null,null,null,"Latitudine"]
[null,null,null,null,null,null,null,null,null,null,null,null,null,null,null,null,null,null,null,null,null,null,null,null,null,null,null,null,null,null,null,null,null,null,null,null,null,null,"GEN.",null,"FEB.",null,"MAR.",null,"APR.",null,"MAG.",null,"GIU.",null,"LUG.",null,"AGO.",null,"SET.",null,"OTT.",null,"NOV.",null,"DIC."]
["N°","Sigla","Località","Altitudine","GEN.","FEB.","MAR.","APR.","MAG.","GIU.","LUG.","AGO."," SET.","OTT.","NOV.","DIC.",null,"N°","Sigla","Località","Altitudine","Zona di","w","Direzione",null,"N°","Sigla","Località","Altitudine","Latitudine",null,"Longitudine",null,"T min ext",null,"N°","Sigla","Località","Hd h","Hb h","Hd h","Hb h","Hd h","Hb h","Hd h","Hb h","Hd h","Hb h","Hd h","Hb h","Hd h","Hb h","Hd h","Hb h","Hd h","Hb h","Hd h","Hb h","Hd h","Hb h","Hd h","Hb h"]
[null,"Provincia",null,"m","°C","°C","°C","°C","°C","°C","°C","°C","°C","°C","°C","°C",null,null,"Provincia",null,"m","vento","m/s","prevalente",null,null,"Provincia",null,"m","°","  '","°","  '",null,null,null,"Prov",null,"MJ/m2","MJ/m2","MJ/m2","MJ/m2","MJ/m2","MJ/m2","MJ/m2","MJ/m2","MJ/m2","MJ/m2","MJ/m2","MJ/m2","MJ/m2","MJ/m2","MJ/m2","MJ/m2","MJ/m2","MJ/m2","MJ/m2","MJ/m2","MJ/m2","MJ/m2","MJ/m2","MJ/m2",null,"COMUNE","ZonaClimat","PeriodoRis","GradGiorno",null,"COMUNE","ProvSigla","UmRelEST",null,null,"TEMP.MAX.ESTIVA"]
[1,"AG","Agrigento",230,10.4,10.8,12.7,15.6,19.399999999999999,24.1,26.9,26.5,24,19.899999999999999,15.9,12.2,null,1,"AG","Agrigento",230,"3",4.5,"NW",null,1,"AG","Agrigento",230,"37","18","13","35",3,null,1,"AG","Agrigento",3.4,"5,4","4,2","8,3","5,3","11,6","6,2","16,0","6,3","20,6","6,0","23,5","5,4","24,2","4,8","22,2","4,9","16,0","4,3","10,3","3,5","6,6","3,0","5,2",1,"AGRIGENTO","B",121,729,1,"AGRIGENTO","AG",59.8,null,null,1,"AG","Agrigento","33,0"]
[2,"AL","Alessandria",95,0,2.8,8.1,13.1,17.3,22,24.7,23.6,19.899999999999999,13.1,6.9,1.9,null,2,"AL","Alessandria",95,"1",1.2,"SE",null,2,"AL","Alessandria",95,"44","54","8","36",-8,null,2,"AL","Alessandria",2.4,"2,3","3,5","4,0","5,1","6,5","6,7","9,1","7,9","10,6","8,4","12,1","7,7","14,9","7,0","11,0","5,6","7,8","4,0","4,5","2,7","2,6","2,1","2,1",2,"ALESSANDRIA","E",183,2559,2,"ALESSANDRIA","AL",44.4,null,null,2,"AL","Alessandria","30,5"]
[3,"AN","Ancona",16,6.3,7.1,9.9,13.4,17,21.8,24.4,24.1,21.3,16.5,12.1,7.8,null,3,"AN","Ancona",16,"2",3.2,"W",null,3,"AN","Ancona",16,"43","36","16","30",-2,null,3,"AN","Ancona",2.5,"1,8","3,7","3,9","5,2","6,9","6,6","11,7","7,4","15,7","7,9","16,2","6,9","19,1","6,4","15,6","5,4","10,6","4,1","6,4","2,8","2,7","2,3","1,8",3,"ANCONA","D",166,1688,3,"ANCONA","AN",37,null,null,3,"AN","Ancona","30,1"]
[4,"AO","Aosta",583,-0.3,2.6,6.7,11,14.7,18.7,20.5,19.399999999999999,15.9,10.3,4.8,0.8,null,4,"AO","Aosta",583,"2",2.6,"N",null,4,"AO","Aosta",583,"45","44","7","18",-10,null,4,"AO","Aosta",2.4,"2,9","3,4","4,6","4,9","7,2","6,7","9,0","7,9","10,3","8,4","11,5","8,0","13,0","7,1","10,4","5,6","7,6","3,9","4,8","2,6","3,5","2,1","2,7",4,"AOSTA","E",183,2850,4,"AOSTA","AO",44.4,null,null,4,"AO","Aosta","28,7"]
[5,"AR","Arezzo",246,5.0999999999999996,5.9,9.1999999999999993,12.6,16.399999999999999,20.9,24,23.4,20.3,15,10.199999999999999,6.1,null,5,"AR","Arezzo",246,"2",4.5,"NE",null,5,"AR","Arezzo",246,"43","27","11","52",0,null,5,"AR","Arezzo",2.6,"2,5","3,7","3,9","5,2","6,0","6,9","8,2","8,0","11,2","8,2","14,0","7,7","15,4","7,0","12,2","5,6","9,3","4,2","5,2","2,9","2,9","2,3","1,8",5,"AREZZO","E",183,2104,5,"AREZZO","AR",28.3,null,null,5,"AR","Arezzo","31,5"]
[6,"AP","Ascoli Piceno",154,5.5,6.6,9.5,13.3,17.2,21.7,24.4,24.3,21.1,15.8,10.9,7,null,6,"AP","Ascoli Piceno",154,"1",1.7,"W",null,6,"AP","Ascoli Piceno",154,"42","51","13","34",-2,null,6,"AP","Ascoli Piceno",2.8,"2,6","3,8","4,4","5,3","7,3","6,8","10,4","7,8","13,0","8,0","15,7","7,1","18,5","6,3","16,0","5,5","10,8","4,2","6,2","3,0","3,4","2,5","2,3",6,"ASCOLI PICENO","D",166,1698,6,"ASCOLI PICENO","AP",39.799999999999997,null,null,6,"AP","Ascoli Piceno","32,9"]
[7,"AT","Asti",123,-0.4,2.7,7.9,13,17,21.6,24.2,22.9,18.899999999999999,12.7,6.1,1.3,null,7,"AT","Asti",123,"1",1.5,"SW",null,7,"AT","Asti",123,"44","53","8","12",-8,null,7,"AT","Asti",2.5,"2,7","3,5","4,4","5,1","6,9","6,7","9,6","7,9","10,7","8,4","12,2","7,8","14,7","7,1","10,7","5,6","7,5","4,0","5,1","2,7","2,9","2,1","2,7",7,"ASTI","E",183,2617,7,"ASTI","AT",44.4,null,null,7,"AT","Asti","32,1"]
[8,"AV","Avellino",348,5.5,6.5,8.8000000000000007,12.4,16,20.3,23.1,22.6,19.600000000000001,14.8,10.4,6.8,null,8,"AV","Avellino",348,"2",4.4000000000000004,"W",null,8,"AV","Avellino",348,"40","54","14","47",-2,null,8,"AV","Avellino",2.9,"2,5","4,0","4,4","5,5","7,2","6,8","11,3","7,6","14,7","7,8","16,9","6,6","20,3","6,0","17,9","5,4","12,3","4,3","7,7","3,2","3,8","2,6","2,3",8,"AVELLINO","D",166,1742,8,"AVELLINO","AV",48.8,null,null,8,"AV","Avellino","30,1"]
[9,"BA","Bari",5,8.6,9.1999999999999993,11.1,14.2,18,22.3,24.7,24.5,22,17.899999999999999,14,10.199999999999999,null,9,"BA","Bari",5,"2",3.5,"W",null,9,"BA","Bari",5,"41","08","16","50",0,null,9,"BA","Bari","3,0","3,6","3,9","6,2","5,3","9,2","6,3","14,3","6,8","18,5","6,7","21,3","5,9","22,7","5,4","19,8","5,0","14,0","4,0","9,2","3,1","4,9","2,7","3,0",9,"BARI","C",137,1185,9,"BARI","BA",41.7,null,null,9,"BA","Bari","32,3"]
[10,"BL","Belluno",383,0.1,2.2999999999999998,6.8,11.2,14.9,18.899999999999999,21.2,20.8,17.7,12.4,6.5,1.7,null,10,"BL","Belluno",383,"1",0.9,"E",null,10,"BL","Belluno",383,"46","08","12","13",-10,null,10,"BL","Belluno",2.2999999999999998,"2,0","3,4","4,1","4,9","7,0","6,7","8,6","7,9","11,4","8,4","12,1","7,9","14,0","7,0","10,8","5,5","8,4","3,8","5,3","2,5","2,3","2,0","1,9",10,"BELLUNO","E",183,2936,10,"BELLUNO","BL",38.9,null,null,10,"BL","Belluno","31,1"]
[11,"BN","Benevento",135,6.8,7.7,10.3,13.7,17.5,22.1,24.8,24.3,21.4,16.5,12.1,8,null,11,"BN","Benevento",135,"2",4.4000000000000004,"W",null,11,"BN","Benevento",135,"41","07","14","46",-2,null,11,"BN","Benevento",2.9,"2,8","4,0","4,7","5,5","7,4","6,9","10,3","7,8","13,1","7,8","16,8","6,8","19,6","6,3","16,6","5,7","10,7","4,3","6,8","3,2","3,4","2,6","2,3",11,"BENEVENTO","C",137,1316,11,"BENEVENTO","BN",48.8,null,null,11,"BN","Benevento","32,2"]
[12,"BG","Bergamo",249,3.1,4.9000000000000004,8.9,13.3,17,21.3,23.7,23.2,19.899999999999999,14.2,8.6,4.5,null,12,"BG","Bergamo",249,"1",1.9,"NE",null,12,"BG","Bergamo",249,"45","41","9","40",-5,null,12,"BG","Bergamo",2.2999999999999998,"1,9","3,4","3,5","5,0","6,3","6,7","8,9","7,9","11,2","8,4","12,2","7,8","14,6","6,9","11,9","5,5","8,5","3,9","5,2","2,6","2,1","2,1","1,8",12,"BERGAMO","E",183,2533,12,"BERGAMO","BG",38.700000000000003,null,null,12,"BG","Bergamo","31,0"]
[13,"BO","Bologna",54,2.1,4.5999999999999996,9.4,14.2,18.2,22.9,25.4,24.9,21.2,14.9,8.6999999999999993,4,null,13,"BO","Bologna",54,"1",1.6,"SW",null,13,"BO","Bologna",54,"44","29","11","20",-5,null,13,"BO","Bologna",2.5,"2,0","3,6","4,3","5,1","7,0","6,6","10,7","7,7","13,3","8,0","15,6","7,1","18,5","6,6","14,4","5,4","10,0","4,0","5,9","2,7","2,6","2,2","1,9",13,"BOLOGNA","E",183,2259,13,"BOLOGNA","BO",37,null,null,13,"BO","Bologna","33,0"]
[14,"BZ","Bolzano",262,1.2,4.2,9,13.4,16.899999999999999,21,22.7,22,18.8,12.9,6.7,2.2000000000000002,null,14,"BZ","Bolzano",262,"1",0.9,"S",null,14,"BZ","Bolzano",262,"46","29","11","21",-15,null,14,"BZ","Bolzano",2.2999999999999998,"2,2","3,3","4,9","4,9","7,8","6,6","9,9","7,8","12,5","8,4","12,9","7,8","14,7","6,9","11,6","5,4","8,8","3,8","5,5","2,5","2,6","2,0","1,9",14,"BOLZANO","E",183,2791,14,"BOLZANO","BZ",38.9,null,null,14,"BZ","Bolzano","31,4"]
[15,"BS","Brescia",149,1.5,4.2,9.3000000000000007,13.5,17.7,22,24.4,23.7,19.899999999999999,14,7.8,3.5,null,15,"BS","Brescia",149,"1",1.5,"E",null,15,"BS","Brescia",149,"45","32","10","12",-7,null,15,"BS","Brescia",2.4,"2,2","3,5","4,3","5,0","7,4","6,7","9,4","7,8","12,6","8,2","14,3","7,4","17,0","6,7","13,5","5,4","9,3","3,9","5,3","2,6","2,7","2,1","2,2",15,"BRESCIA","E",183,2410,15,"BRESCIA","BS",38.700000000000003,null,null,15,"BS","Brescia","31,8"]
[16,"BR","Brindisi",15,9.3000000000000007,9.6,11.4,14.2,18,22,24.5,24.5,22.1,18.3,14.4,10.9,null,16,"BR","Brindisi",15,"2",5.0999999999999996,"NW",null,16,"BR","Brindisi",15,"40","38","17","56",0,null,16,"BR","Brindisi","3,0","4,0","4,0","5,3","5,4","8,7","6,6","13,0","7,4","16,1","7,1","19,9","6,4","21,0","6,0","17,9","5,3","13,1","4,1","8,9","3,2","4,7","2,7","3,2",16,"BRINDISI","C",137,1083,16,"BRINDISI","BR",41.7,null,null,16,"BR","Brindisi","31,5"]
[17,"CA","Cagliari",4,10.3,10.8,12.8,15.1,18.399999999999999,22.9,25.5,25.5,23.3,19.399999999999999,15.5,11.7,null,17,"CA","Cagliari",4,"3","4,0","NW",null,17,"CA","Cagliari",4,"39","13","9","07",3,null,17,"CA","Cagliari",3.2,"4,1","4,2","5,6","5,5","8,9","6,9","11,6","7,6","14,9","7,7","17,3","6,5","20,8","6,2","17,7","5,7","11,9","4,5","7,7","3,4","4,7","2,9","3,5",17,"CAGLIARI","C",137,990,17,"CAGLIARI","CA",59.5,null,null,17,"CA","Cagliari","32,1"]
[18,"CL","Caltanissetta",568,7.2,7.8,9.9,13.1,17.3,22.5,25.7,25.2,22.1,17.3,12.8,8.9,null,18,"CL","Caltanissetta",568,"3","2,4","W",null,18,"CL","Caltanissetta",568,"37","29","14","03",0,null,18,"CL","Caltanissetta",3.3,"5,7","4,2","7,7","5,5","10,5","6,6","14,2","6,9","18,6","6,6","21,6","6,1","22,1","5,6","19,8","5,4","14,1","4,5","9,3","3,4","6,6","3,0","5,0",18,"CALTANISSETTA","D",166,1550,18,"CALTANISSETTA","CL",59.8,null,null,18,"CL","Caltanissetta","34,0"]
[19,"CB","Campobasso",701,3.7,4.8,7.3,11.1,14.8,19.600000000000001,22.5,22.2,18.899999999999999,13.5,9,5,null,19,"CB","Campobasso",701,"2",4.3,"W",null,19,"CB","Campobasso",701,"41","33","14","40",-4,null,19,"CB","Campobasso",2.9,"3,3","3,9","5,6","5,4","8,1","6,7","12,0","7,4","16,1","7,6","17,7","6,9","19,6","6,2","16,9","5,4","12,0","4,2","7,8","3,1","4,2","2,6","3,0",19,"CAMPOBASSO","E",183,2346,19,"CAMPOBASSO","CB",48.8,null,null,19,"CB","Campobasso","29,6"]
[20,"CE","Caserta",68,8.6999999999999993,9.4,12,15.3,19.100000000000001,23.5,26.2,26.1,23,18.2,13.9,10.3,null,20,"CE","Caserta",68,"2",1.6,"S",null,20,"CE","Caserta",68,"41","04","14","19",0,null,20,"CE","Caserta",2.9,"3,9","3,9","5,8","5,3","9,2","6,6","12,8","7,3","16,5","7,0","20,1","6,2","21,6","5,9","18,3","5,2","13,1","4,0","8,9","3,1","4,7","2,6","3,3",20,"CASERTA","C",137,1013,20,"CASERTA","CE",48.8,null,null,20,"CE","Caserta","32,1"]
[21,"CT","Catania",7,10.7,11.2,12.9,15.5,19.100000000000001,23.5,26.5,26.5,24.1,19.899999999999999,15.9,12.3,null,21,"CT","Catania",7,"3","4,4","W",null,21,"CT","Catania",7,"37",30,"15","05",5,null,21,"CT","Catania",3.3,"5,7","4,2","7,7","5,5","10,5","6,6","14,1","6,9","18,6","6,6","21,6","6,1","22,1","5,6","19,8","5,4","14,1","4,5","9,2","3,4","6,6","3,0","5,0",21,"CATANIA","B",121,833,21,"CATANIA","CT",59.8,null,null,21,"CT","Catania","33,6"]
[22,"CZ","Catanzaro",320,8.3000000000000007,8.6999999999999993,10.4,13.4,17,21.7,24.4,24.8,22.3,17.899999999999999,13.7,10.1,null,22,"CZ","Catanzaro",320,"2","3,2","W",null,22,"CZ","Catanzaro",320,"38","54","16","35",-2,null,22,"CZ","Catanzaro",3.2,"4,1","4,1","7,1","5,7","7,1","6,9","12,0","7,5","15,6","7,1","19,8","6,5","20,9","5,6","19,6","5,9","10,9","4,5","8,0","3,5","4,4","2,9","3,6",22,"CATANZARO","C",137,1328,22,"CATANZARO","CZ",59.8,null,null,22,"CZ","Catanzaro","33,0"]
[23,"CH","Chieti",330,5.8,6.8,9.6,13.5,17.2,22,24.7,24.3,21.2,15.9,11.3,7.2,null,23,"CH","Chieti",330,"2","2,0","SW",null,23,"CH","Chieti",330,"42","21","14","10",0,null,23,"CH","Chieti",2.8,"3,1","3,9","4,9","5,3","7,8","6,6","12,1","7,3","16,0","7,8","17,0","6,8","19,6","6,4","16,1","5,3","11,8","4,0","7,8","3,0","3,8","2,5","2,6",23,"CHIETI","D",166,1556,23,"CHIETI","CH",39.799999999999997,null,null,23,"CH","Chieti","29,4"]
[24,"CO","Como",201,2.9,5,8.8000000000000007,12.7,16.7,21.1,23.6,23.1,19.600000000000001,13.7,8.4,4.4000000000000004,null,24,"CO","Como",201,"1","0,9","S",null,24,"CO","Como",201,"45","48","9","05",-5,null,24,"CO","Como",2.4,"2,2","3,4","3,4","5,0","6,1","6,7","8,9","7,9","10,2","8,4","12,1","7,9","14,2","7,0","11,0","5,6","7,5","3,9","5,1","2,6","2,3","2,1","1,9",24,"COMO","E",183,2228,24,"COMO","CO",38.700000000000003,null,null,24,"CO","Como","32,0"]
[25,"CS","Cosenza",238,8.1,8.8000000000000007,11.3,14.4,18.100000000000001,23.1,26,25.8,22.7,17.8,13.4,9.4,null,25,"CS","Cosenza",238,"2","2,4","W",null,25,"CS","Cosenza",238,"39",18,"16","15",-3,null,25,"CS","Cosenza",3.2,"4,5","3,9","7,9","4,9","12,4","6,2","15,6","6,8","18,9","6,0","23,6","5,8","23,1","5,2","20,8","4,9","15,1","4,3","8,6","3,2","6,2","2,8","4,9",25,"COSENZA","C",137,1317,25,"COSENZA","CS",59.8,null,null,25,"CS","Cosenza","33,6"]
[26,"CR","Cremona",45,0.7,3.3,8.4,13.3,17.399999999999999,21.9,24.3,23.4,19.7,13.4,7.2,2.5,null,26,"CR","Cremona",45,"1","1,4","E",null,26,"CR","Cremona",45,"45","08","10","01",-5,null,26,"CR","Cremona",2.2999999999999998,"1,6","3,5","3,3","5,1","6,4","6,7","10,1","7,8","12,7","8,0","15,8","7,2","17,8","6,7","13,5","5,5","8,8","4,0","4,4","2,6","1,9","2,0","1,3",26,"CREMONA","E",183,2389,26,"CREMONA","CR",38.700000000000003,null,null,26,"CR","Cremona","33,0"]
[27,"KR","Crotone","8",9.5,9.8000000000000007,11.5,14.7,18.399999999999999,22.9,26.2,26,23.5,19.3,15.1,11.2,null,27,"KR","Crotone","8","3","3,5","N",null,27,"KR","Crotone","8","39","04","17","07",3,null,27,"KR","Crotone","3,2","4,2","4,2","6,5","5,5","9,0","6,8","12,5","7,4","16,1","7,4","18,7","6,8","19,8","6,0","18,3","5,6","12,3","4,4","8,6","3,4","5,2","2,9","3,5",27,"CROTONE","B",121,899,27,"CROTONE","KR",59.8,null,null,27,"KR","Crotone","34,5"]
[28,"CN","Cuneo",534,1.1000000000000001,2.9,6.9,11.3,14.8,19.399999999999999,21.9,21,17.7,11.7,6.2,2.5,null,28,"CN","Cuneo",534,"2","1,6","NE",null,28,"CN","Cuneo",534,"44","22","7","32",-10,null,28,"CN","Cuneo",2.5,"3,0","3,6","4,5","5,2","6,3","6,8","7,8","8,0","8,4","8,5","10,1","8,1","12,2","7,2","8,8","5,7","6,7","4,1","4,6","2,8","3,1","2,2","2,8",28,"CUNEO","F",217,3012,28,"CUNEO","CN",44.4,null,null,28,"CN","Cuneo","29,0"]
[29,"EN","Enna",931,4.5,5.0999999999999996,7.1,10.7,14.9,20.6,23.9,23.2,19.899999999999999,14.5,9.8000000000000007,6.4,null,29,"EN","Enna",931,"3","3,8","W",null,29,"EN","Enna",931,"37","33","14","16",-3,null,29,"EN","Enna",3.3,"5,6","4,2","7,7","5,5","10,6","6,5","14,6","6,8","18,9","6,5","22,1","6,0","22,6","5,4","20,5","5,3","14,5","4,5","9,4","3,4","6,7","3,0","4,9",29,"ENNA","E",183,2248,29,"ENNA","EN",59.8,null,null,29,"EN","Enna","29,2"]
[30,"FE","Ferrara",9,1.4,3.3,7.8,12.8,17.3,21.6,23.9,23.5,20.100000000000001,14,8.1999999999999993,3.2,null,30,"FE","Ferrara",9,"1","2,4","W",null,30,"FE","Ferrara",9,"44","50","11","37",-5,null,30,"FE","Ferrara",2.5,"2,1","3,6","4,1","5,2","5,7","6,7","10,7","7,7","13,4","8,2","14,2","7,5","16,4","7,0","12,2","5,4","10,2","3,9","6,8","2,7","2,0","2,1","1,3",30,"FERRARA","E",183,2326,30,"FERRARA","FE",37,null,null,30,"FE","Ferrara","32,2"]
[31,"FI","Firenze",40,5.3,6.5,9.9,13.8,17.8,22.2,25,24.3,20.9,15.3,10.199999999999999,6.3,null,31,"FI","Firenze",40,"2","1,4","NE",null,31,"FI","Firenze",40,"43","41","11","15",0,null,31,"FI","Firenze",2.6,"2,7","3,7","4,5","5,2","7,0","6,7","10,7","7,6","14,3","7,9","16,2","7,0","18,6","6,5","15,2","5,3","11,0","4,0","6,9","2,9","3,2","2,3","2,3",31,"FIRENZE","D",166,1821,31,"FIRENZE","FI",28.3,null,null,31,"FI","Firenze","33,6"]
[32,"FG","Foggia",76,6.4,7.3,10,13.8,17.899999999999999,23.2,26,25.5,22.1,16.899999999999999,12.2,7.9,null,32,"FG","Foggia",76,"1","3,5","NW",null,32,"FG","Foggia",76,"41","27","15","33",0,null,32,"FG","Foggia","2,9","3,5","3,9","5,8","5,3","8,6","6,5","13,0","7,3","16,5","7,5","18,2","6,8","19,8","6,2","17,0","5,3","12,5","4,1","8,4","3,1","4,6","2,6","3,1",32,"FOGGIA","D",166,1530,32,"FOGGIA","FG",41.7,null,null,32,"FG","Foggia","33,9"]
[33,"FO","Forlì",34,3,4.5999999999999996,9,13.7,17.8,22.6,25.3,24.8,21.1,15.1,9.3000000000000007,4.4000000000000004,null,33,"FO","Forlì",34,"1","2,3","NW",null,33,"FO","Forlì",34,"44","13","12","02",-5,null,33,"FO","Forlì",2.5,"2,3","3,6","4,3","5,1","7,5","6,6","11,1","7,5","14,7","7,7","17,6","6,7","19,9","6,3","15,9","5,2","11,4","4,0","6,3","2,8","2,7","2,2","1,9",33,"FORLì","D",166,2087,33,"FORLI'","FO",37,null,null,33,"FO","Forlì","32,0"]
[34,"FR","Frosinone",291,5.8,6.2,8,11,15.2,18.5,21.5,20.9,18.8,13.4,9.1999999999999993,5,null,34,"FR","Frosinone",291,"2","1,7","S",null,34,"FR","Frosinone",291,"41","38","13","20",0,null,34,"FR","Frosinone",2.9,"3,6","3,9","5,3","5,3","8,5","6,7","10,7","7,7","13,2","7,6","17,0","6,9","19,0","6,4","15,9","5,4","11,8","4,2","7,4","3,1","4,3","2,5","3,1",34,"FROSINONE","E",183,2196,34,"FROSINONE","FR",39.799999999999997,null,null,34,"FR","Frosinone","30,7"]
[35,"GE","Genova",19,7.9,8.9,11.6,14.7,17.8,21.9,24.5,24.6,22.3,17.100000000000001,12.9,9.3000000000000007,null,35,"GE","Genova",19,"3","3,8","NE",null,35,"GE","Genova",19,"44","25","8","53",0,null,35,"GE","Genova",2.5,2.8,"3,6","4,6","5,1","7,4","6,7","10,2","7,8","12,8","8,2","14,5","7,4","17,4","6,8","13,7","5,5","9,9","4,0","6,6","2,8","3,0","2,2","2,7",35,"GENOVA","D",166,1435,35,"GENOVA","GE",63.2,null,null,35,"GE","Genova","29,9"]
[36,"GO","Gorizia",84,4.7,5.6,8.1999999999999993,11.9,16.7,19.899999999999999,22,22.2,18.600000000000001,13.2,9.1999999999999993,4.7,null,36,"GO","Gorizia",84,"2","1,5","E",null,36,"GO","Gorizia",84,"45","56","13","37",-5,null,36,"GO","Gorizia","2,4","2,2","3,4","3,7","5,0","6,4","6,7","9,5","7,9","11,7","8,3","13,1",7.7,"15,3","6,7","13,4","5,5","9,1","3,9","5,4","2,6","2,7","2,0","1,9",36,"GORIZIA","E",183,2333,36,"GORIZIA","GO",57.5,null,null,36,"GO","Gorizia","30,5"]
[37,"GR","Grosseto",10,6.8,8.1,10.3,13.2,17.100000000000001,21.2,24.1,23.9,21.3,16.399999999999999,11.7,8.1,null,37,"GR","Grosseto",10,"3","2,4","NE",null,37,"GR","Grosseto",10,"42","45","11","06",0,null,37,"GR","Grosseto","2,8","3,2","3,8","4,9","5,3","7,5","6,7","11,5","7,4","15,9","7,6","17,9",6.6,"20,5","6,1","17,2","5,4","11,6","4,0","7,7","3,0","3,7","2,4","2,6",37,"GROSSETO","D",166,1550,37,"GROSSETO","GR",28.3,null,null,37,"GR","Grosseto","33,0"]
[38,"IM","Imperia",10,8.6,9.4,11.6,14.7,17.899999999999999,21.7,24.5,24.1,21.8,17.399999999999999,12.7,9.5,null,38,"IM","Imperia",10,3,"3,7","NE",null,38,"IM","Imperia",10,43,53,8,1,0,null,38,"IM","Imperia","2,6","3,4","3,6","5,4","5,1","8,2","6,5","12,0","7,6","14,5","7,8","16,9",6.8,"19,6","6,5","15,2","5,3","11,2","3,9","7,7","2,8","4,1","2,3","3,3",38,"IMPERIA","C",137,1201,38,"IMPERIA","IM",63.2,null,null,38,"IM","Imperia","29,0"]
[39,"IS","Isernia",423,5.5,5.7,8.6,11.2,15.5,20.100000000000001,23.1,22.8,19.7,14.7,10.3,6.9,null,39,"IS","Isernia",423,"2","4,0","NW",null,39,"IS","Isernia",423,"41","35","14","13",-2,null,39,"IS","Isernia","2,9","3,1","3,9","4,8","5,4","7,5","6,9","9,5","7,9","11,8","8,0","15,3","7,2","18,0","6,6","15,1","5,6","10,6","4,3","6,5","3,1","3,7","2,5","2,7",39,"ISERNIA","D",166,1866,39,"ISERNIA","IS",48.8,null,null,39,"IS","Isernia","29,9"]
[40,"SP","La Spezia",3,6.7,7.3,10.1,13.4,16.7,20.9,23.8,23.7,21.2,16.399999999999999,11.9,8.3000000000000007,null,40,"SP","La Spezia",3,"3","5,5","N",null,40,"SP","La Spezia",3,"44","06","9","49",0,null,40,"SP","La Spezia","2,6","2,7","3,6","4,9","5,1","7,8","6,7","10,4","7,8","12,4","8,0","15,5","7,0","18,8","6,6","14,7","5,4","10,5","4,0","6,3","2,8","3,0","2,3","2,5",40,"LA SPEZIA","D",166,1413,40,"LA SPEZIA","SP",63.2,null,null,40,"SP","La Spezia","30,2"]
[41,"AQ","L'Aquila",714,2,3.6,7.1,11.4,15,19.100000000000001,22,21.8,18.600000000000001,13.1,8.1999999999999993,3.8,null,41,"AQ","L'Aquila",714,"2",1.7,"SE",null,41,"AQ","L'Aquila",714,"42","21","13","23",-5,null,41,"AQ","L'Aquila",2.8,"3,2","3,8","4,6","5,3","6,7","6,9","7,9","8,0","11,3","8,4","12,7","7,7","15,9","7,0","13,1","5,7","10,0","4,2","6,4","3,0","3,4","2,5","2,6",41,"L'AQUILA","E",183,2514,41,"L'AQUILA","AQ",39.799999999999997,null,null,41,"AQ","L'Aquila","29,1"]
[42,"LT","Latina","21",8.3000000000000007,9,10.9,13.5,16.899999999999999,20.9,23.7,23.8,21.5,17.3,12.9,9.5,null,42,"LT","Latina","21","3","2,4","W",null,42,"LT","Latina","21","41","27","12","54",2,null,42,"LT","Latina","2,9","3,8","3,9","5,7","5,2","9,2","6,6","12,9","7,2","16,6","7,0","20,0","6,2","21,7","5,9","18,1","5,2","13,1","4,0","8,7","3,1","4,7","2,6","3,3",42,"LATINA","C",137,1220,42,"LATINA","LT",39.799999999999997,null,null,42,"LT","Latina","33,2"]
[43,"LE","Lecce","49",9,9.3000000000000007,11.4,14.7,18.899999999999999,23.4,26.1,25.9,23,18.5,14.3,10.7,null,43,"LE","Lecce","49","2","4,0","N",null,43,"LE","Lecce","49","40","21","18","10",0,null,43,"LE","Lecce","3,0","3,8","4,0","5,8","5,5","8,1","6,8","12,1","7,3","16,3","7,4","18,7","6,5","20,7","6,0","18,0","5,4","12,5","4,2","8,1","3,3","4,1","2,7","3,2",43,"LECCE","C",137,1153,43,"LECCE","LE",41.7,null,null,43,"LE","Lecce","33,0"]
[44,"LC","Lecco","214",3.9,5.7,9.6,13.3,16,20.100000000000001,22.6,22.1,19.2,14.3,9.1999999999999993,5.3,null,44,"LC","Lecco","214","1","0,9","S",null,44,"LC","Lecco","214","45","51","9","24",-5,null,44,"LC","Lecco","2,4","2,3","3,4","3,6","5,0","6,4","6,7","9,1","7,9","10,5","8,4","12,3","7,9","14,2","7,0","11,2","5,6","7,8","3,9","5,2","2,6","2,5","2,1","2,0",44,"LECCO","E",183,2383,44,"LECCO","LC",38.700000000000003,null,null,44,"LC","Lecco","31,9"]
[45,"LI","Livorno","3",7.5,8.1999999999999993,11.1,13.9,17.3,21.8,24.4,24.1,21.5,17.100000000000001,12.7,9,null,45,"LI","Livorno","3","3","2,4","E",null,45,"LI","Livorno","3","43","33","10","19",0,null,45,"LI","Livorno","2,6","2,8","3,7","4,6","5,2","7,2","6,7","11,2","7,5","15,0","7,9","16,7","6,9","19,3","6,4","15,9","5,3","11,3","4,0","7,3","2,9","3,3","2,3","2,4",45,"LIVORNO","D",166,1408,45,"LIVORNO","LI",28.3,null,null,45,"LI","Livorno","31,0"]
[46,"LD","Lodi","87",0.9,3.3,8.6,13.5,17.8,22.5,24.5,23.4,19.600000000000001,13.4,7.3,2.5,null,46,"LD","Lodi","87","1","1,1","SW",null,46,"LD","Lodi","87","45","18","9","30",-5,null,46,"LD","Lodi","2,3","1,4","3,5","3,1","5,1","6,2","6,7","9,7","7,8","12,2","8,1","14,9","7,4","17,1","6,8","12,8","5,6","8,2","4,0","4,2","2,6","1,8","2,0","1,2",46,"LODI","E",183,2592,46,"LODI","LD",38.700000000000003,null,null,46,"LD","Lodi","32,4"]
[47,"LU","Lucca","19",6.1,7.2,10.1,13.3,17.100000000000001,21.2,23.8,23.6,20.9,15.8,10.9,7.3,null,47,"LU","Lucca","19","2","1,5","E",null,47,"LU","Lucca","19","43","50","10","03",0,null,47,"LU","Lucca","2,6","2,7","3,7","4,2","5,2","7,1","6,8","9,9","7,9","12,4","8,2","14,5","7,3","17,4","6,7","13,8","5,5","10,3","4,0","6,7","2,8","3,0","2,3","2,1",47,"LUCCA","D",166,1715,47,"LUCCA","LU",28.3,null,null,47,"LU","Lucca","32,5"]
[48,"MC","Macerata","315",3.8,5.3,8.3000000000000007,12.4,16.3,20.7,23.5,23.2,19.899999999999999,14.4,9.5,5.7,null,48,"MC","Macerata","315","2","3,4","NW",null,48,"MC","Macerata","315","43","17","13","27",-2,null,48,"MC","Macerata","2,7","2,8","3,7","4,7","5,3","7,2","6,7","10,9","7,5","15,2","7,8","16,7","7,1","18,3","6,5","15,2","5,4","11,1","4,0","7,0","2,9","3,5","2,4","2,4",48,"MACERATA","D",166,2005,48,"MACERATA","MC",28.3,null,null,48,"MC","Macerata","31,2"]
[49,"MN","Mantova","19",1,3.3,8.4,13.3,17.399999999999999,22,24.3,23.6,20,14,8,2.9,null,49,"MN","Mantova","19","1","0,9","E",null,49,"MN","Mantova","19","45","09","10","46",-5,null,49,"MN","Mantova","2,3","1,5","3,5","3,1","5,1","6,0","6,7","9,5","7,8","12,2","8,0","15,5","7,3","17,4","6,8","13,0","5,6","8,2","4,0","4,1","2,6","1,8","2,0","1,3",49,"MANTOVA","E",183,2388,49,"MANTOVA","MN",38.700000000000003,null,null,49,"MN","Mantova","33,0"]
[50,"MS","Massa-Carrara","65",6.8,7.4,10.3,13.2,16.899999999999999,21.2,23.7,23.3,20.6,15.9,11.3,7.9,null,50,"MS","Massa-Carrara","65","2","3,5","N",null,50,"MS","Massa-Carrara","65","44","01","10","07",0,null,50,"MS","Massa-Carrara","2,6","2,7","3,6","4,7","5,1","7,5","6,7","10,2","7,8","12,4","8,1","15,1","7,1","18,3","6,6","14,4","5,4","10,4","4,0","6,4","2,8","3,0","2,3","2,4",50,"MASSA-Carrara","D",166,1525,50,"MASSA","MS",63.2,null,null,50,"MS","Massa-Carrara","32,5"]
[51,"MT","Matera","200",7.7,8.4,10.5,14.2,18.5,23.6,26.7,26.2,22.9,18,13.3,9.3000000000000007,null,51,"MT","Matera","200","1","2,9","N",null,51,"MT","Matera","200","40","39","16","36",-2,null,51,"MT","Matera","3,0","3,3","4,0","5,7","5,5","7,6","6,8","11,6","7,6","15,1","7,7","17,4","6,8","19,7","6,2","17,0","5,4","12,3","4,4","7,2","3,2","3,8","2,7","3,1",51,"MATERA","D",166,1776,51,"MATERA","MT",41.7,null,null,51,"MT","Matera","34,1"]
[52,"ME","Messina","3",11.7,12,13.2,15.7,19.2,23.5,26.4,26.5,24.2,20.3,16.600000000000001,13.3,null,52,"ME","Messina","3","3","2,8","N",null,52,"ME","Messina","3","38","11","15","32",5,null,52,"ME","Messina","3,3","3,9","4,3","6,5","5,6","9,6","6,7","13,6","7,2","17,2","7,0","20,3","6,6","20,6","6,0","18,6","5,4","13,6","4,6","8,3","3,5","5,4","3,0",3.6,52,"MESSINA","B",121,707,52,"MESSINA","ME",59.8,null,null,52,"ME","Messina","32,3"]
[53,"MI","Milano","122",1.7,4.2,9.1999999999999993,14,17.899999999999999,22.5,25.1,24.1,20.399999999999999,14,7.9,3.1,null,53,"MI","Milano","122","1","1,1","SW",null,53,"MI","Milano","122","45","27","9","11",-5,null,53,"MI","Milano","2,3","1,5","3,5","3,2","5,1","6,5","6,7","9,8","7,9","12,1","8,3","13,9","7,5","16,5","6,9","12,5","5,6","8,4","3,9","4,5","2,5","1,9","2,0","1,3",53,"MILANO","E",183,2404,53,"MILANO","MI",38.700000000000003,null,null,53,"MI","Milano","31,9"]
[54,"MO","Modena","34",1.4,3.5,8.6,13.3,17.2,21.8,24.3,23.8,20.100000000000001,14,8.1,3.1,null,54,"MO","Modena","34","1","1,6","SW",null,54,"MO","Modena","34","44","38","10","55",-5,null,54,"MO","Modena","2,5","1,9","3,6","3,4","5,1","6,7","6,7","10,5","7,6","14,0","7,9","16,1","7,2","17,8","6,8","13,5","5,5","9,6","4,0","6,0","2,7","2,6","2,2","1,9",54,"MODENA","E",183,2258,54,"MODENA","MO",37,null,null,54,"MO","Modena","32,2"]
[55,"NA","Napoli","17",10.5,10.6,13.2,16,19.5,24.1,26.7,26.5,23.8,19.600000000000001,15.5,12.1,null,55,"NA","Napoli","17","3","2,3","NE",null,55,"NA","Napoli","17","40","51","14","15",2,null,55,"NA","Napoli","3,0","3,7","4,0","5,6","5,4","8,5","6,7","12,2","7,4","16,3","7,4","18,9","6,6","20,6","6,0","17,9","5,4","12,4","4,1","8,7","3,2","4,4","2,7","3,1",55,"NAPOLI","C",137,1034,55,"NAPOLI","NA",48.8,null,null,55,"NA","Napoli","32,4"]
[56,"NO","Novara","159",0.9,3.3,8.4,13.1,17.399999999999999,21.8,24.3,23.3,19.2,12.9,7.1,2.4,null,56,"NO","Novara","159","1","0,8","N",null,56,"NO","Novara","159","45","25","8","37",-5,null,56,"NO","Novara","2,3","1,7","3,5","3,7","5,0","6,8","6,6","10,2","7,8","12,2","8,2","14,2","7,4","16,9","6,8","12,8","5,5","8,7","3,9","4,3","2,6","2,2","2,0","1,4",56,"NOVARA","E",183,2463,56,"NOVARA","NO",44.4,null,null,56,"NO","Novara","30,7"]
[57,"NU","Nuoro","546",6.2,6.7,9.5,12.4,15.7,21.1,24.3,24.1,20.9,15.7,11.2,7.6,null,57,"NU","Nuoro","546","3","2,4","NW",null,57,"NU","Nuoro","546","40","19","9","19",0,null,57,"NU","Nuoro","3,1","3,8","4,1","5,5","5,4","8,8","6,8","12,1","7,3","16,3","7,3","18,9","6,2","21,8","6,1","17,8","5,4","12,7","4,3","8,0","3,3","4,4","2,8","3,2",57,"NUORO","D",166,1602,57,"NUORO","NU",59.5,null,null,57,"NU","Nuoro","31,0"]
[58,"OR","Oristano","9",9.6,10.199999999999999,12.3,14.5,17.399999999999999,21.4,23.5,24.1,22.6,18.7,14.4,10.8,null,58,"OR","Oristano","9","4","4,3","NW",null,58,"OR","Oristano","9","39","54","8","35",3,null,58,"OR","Oristano","3,1","3,9","4,1","5,8","5,4","8,9","6,8","12,0","7,4","15,9","7,5","18,2","6,3","21,3","6,1","17,9","5,4","12,8","4,3","8,3",3.3,"4,5","2,8","3,3",58,"ORISTANO","C",137,1059,58,"ORISTANO","OR",59.5,null,null,58,"OR","Oristano","32,9"]
[59,"PD","Padova","12",1.9,4,8.4,13,17.100000000000001,21.3,23.6,23.1,19.7,13.8,8.1999999999999993,3.6,null,59,"PD","Padova","12","1","1,0","NE",null,59,"PD","Padova","12","45","24","11","52",-5,null,59,"PD","Padova","2,3","1,8","3,5","3,6","5,1","5,9","6,7","8,0","7,9","10,9","8,4","12,2","8,0","13,5","7,0","11,7","5,5","8,9","3,9","5,5","2,6","2,4","2,1","2,1",59,"PADOVA","E",183,2383,59,"PADOVA","PD",38.9,null,null,59,"PD","Padova","32,5"]
[60,"PA","Palermo","14",11.1,11.6,13.1,15.5,18.8,22.7,25.5,25.4,23.6,19.8,16,12.6,null,60,"PA","Palermo","14","3","3,6","SW",null,60,"PA","Palermo","14","38","07","13","21",5,null,60,"PA","Palermo","3,3","4,4","4,3","6,8","5,5","10,2","6,6","14,2","6,9","18,3","6,8","21,1","6,3","21,6","5,6","19,6","5,2","14,4","4,4","9,1","3,5","5,8","3,0","3,9",60,"PALERMO","B",121,751,60,"PALERMO","PA",59.8,null,null,60,"PA","Palermo","32,6"]
[61,"PR","Parma","57",0.9,3.5,8.9,13.7,17.600000000000001,22.2,24.7,24,20.2,14.1,8,2.8,null,61,"PR","Parma","57","1","1,1","E",null,61,"PR","Parma","57","44","48","10","19",-5,null,61,"PR","Parma","2,4","1,9","3,6","4,1","5,0","8,0","6,5","11,8","7,6","13,9","7,8","17,0","6,8","19,5","6,4","15,4","5,1","11,8","4,0","6,0","2,7","2,5","2,1","1,6",61,"PARMA","E",183,2502,61,"PARMA","PR",37,null,null,61,"PR","Parma","31,0"]
[62,"PV","Pavia","77",0.5,3.2,8.4,12.9,17.100000000000001,21.3,23.5,22.7,19.3,13.3,7.1,2.2999999999999998,null,62,"PV","Pavia","77","1","1,2","S",null,62,"PV","Pavia","77","45","11","9","09",-5,null,62,"PV","Pavia","2,3","1,4","3,5","3,0","5,1","6,0","6,7","9,6","7,8","12,3","8,0","15,7","7,3","17,5","6,8","13,1","5,6","8,1","4,0","4,0","2,6","1,7","2,0","1,2",62,"PAVIA","E",183,2623,62,"PAVIA","PV",38.700000000000003,null,null,62,"PV","Pavia","32,0"]
[63,"PG","Perugia","493",4,5,8.1,11.5,15.4,20.100000000000001,23.1,22.7,19.600000000000001,14.1,9.4,5.5,null,63,"PG","Perugia","493","2","1,4","NE",null,63,"PG","Perugia","493","43","06","12","23",-2,null,63,"PG","Perugia","2,7","2,8","3,8","4,1","5,3","7,0","6,8","9,8","7,7","13,7","8,0","15,6","7,1","18,4","6,6","14,9","5,5","10,6","4,0","7,4","2,9","3,4","2,4","2,2",63,"PERUGIA","E",183,2289,63,"PERUGIA","PG",28.3,null,null,63,"PG","Perugia","28,6"]
[64,"PS","Pesaro e Urbino","11",3.6,4.7,8.4,12.3,16.2,20.6,23.2,22.7,19.7,14.7,9.9,5.4,null,64,"PS","Pesaro e Urbino","11","2","3,4","S",null,64,"PS","Pesaro e Urbino","11","43","54","12","54",-2,null,64,"PS","Pesaro e Urbino","2,4","1,6","3,6","3,4","5,2","6,9","6,7","10,7","7,7","13,5","8,1","14,9","7,1","18,3","6,4","15,4","5,5","10,1","4,1","5,6","2,8","2,6","2,2","1,7",64,"PESARO e URBINO","D",166,2083,64,"PESARO URBINO","PS",28.3,null,null,64,"PS","Pesaro e Urbino","30,5"]
[65,"PE","Pescara","4",7.2,8.4,10.9,14.2,18.5,22.7,25.4,25,22,17.399999999999999,12.5,8.6999999999999993,null,65,"PE","Pescara","4","2","2,0","SW",null,65,"PE","Pescara","4","42","27","14","12",2,null,65,"PE","Pescara","2,8","2,9","3,9","4,7","5,3","7,5","6,6","11,9","7,4","15,6","7,9","16,5","6,9","19,2","6,5","15,7","5,4","11,4","4,1","7,4","3,0","3,7","2,5","2,4",65,"PESCARA","D",166,1718,65,"PESCARA","PE",39.799999999999997,null,null,65,"PE","Pescara","31,6"]
[66,"PC","Piacenza","61",0.1,2.4,7.7,12.2,16.3,20.7,23.2,22.3,18.899999999999999,12.8,6.9,2,null,66,"PC","Piacenza","61","1","1,2","E",null,66,"PC","Piacenza","61","45","03","9","41",-5,null,66,"PC","Piacenza","2,4","2,0","3,5","3,8","5,1","7,1","6,6","10,9","7,7","13,4","8,0","15,9","7,1","18,4","6,6","14,1","5,4","9,9","4,0","5,1",2.6,"2,2","2,1","1,4",66,"PIACENZA","E",183,2715,66,"PIACENZA","PC",38.700000000000003,null,null,66,"PC","Piacenza","32,6"]
[67,"PI","Pisa","4",6.7,7.7,10.6,13.6,17.2,21.1,23.5,23.5,20.9,16.3,11.7,7.8,null,67,"PI","Pisa","4","3","2,4","E",null,67,"PI","Pisa","4","43","42","10","24",0,null,67,"PI","Pisa","2,6","2,7","3,7","4,6","5,2","7,1","6,7","11,1","7,5","14,8","7,9","16,5","6,9","19,1","6,4","15,6","5,3","11,3","4,0","7,2","2,9","3,2","2,3","2,4",67,"PISA","D",166,1694,67,"PISA","PI",28.3,null,null,67,"PI","Pisa","31,5"]
[68,"PT","Pistoia","67",5.3,6.5,9.9,13.4,17.2,21.3,24.1,23.6,20.9,15.3,10.4,6.3,null,68,"PT","Pisoia","67","2","3,7","S",null,68,"PT","Pisoia","67","43","55","10","54",0,null,68,"PT","Pistoia","2,6","2,4","3,7","4,0","5,2","6,1","6,8","8,1","8,0","9,9","8,4","11,6","7,7","15,3","6,9","12,8","5,6","9,2","4,1","5,9","2,8","2,9","2,3","2,1",68,"PISTOIA","D",166,1885,68,"PISTOIA","PT",28.3,null,null,68,"PT","Pisoia","31,6"]
[69,"PN","Pordenone","24",2.2999999999999998,4.4000000000000004,8.1,12.1,15.7,18.399999999999999,21.5,21.2,18.3,12.9,7.4,3.8,null,69,"PN","Pordenone","24","1","1,3","NE",null,69,"PN","Pordenone","24","45","57","12","39",-5,null,69,"PN","Pordenone","2,3","2,2","3,4","4,1","5,0","6,4","6,7","8,3","7,9","11,0","8,3","12,8","7,9","14,1","6,8","12,8","5,4","9,0","3,9","5,5","2,5","2,2","2,0","1,9",69,"PORDENONE","E",183,2459,69,"PORDENONE","PN",57.5,null,null,69,"PN","Pordenone","33,0"]
[70,"PZ","Potenza","819",3.6,4.3,6.8,10.6,14.7,19.100000000000001,21.9,21.9,18.899999999999999,13.7,9.3000000000000007,5.2,null,70,"PZ","Potenza","819","3","3,8","W",null,70,"PZ","Potenza","819","40","38","15","48",-3,null,70,"PZ","Potenza","3,0","3,0","4,1","4,8","5,5","7,5","6,9","10,9","7,7","14,2","7,6","17,7","7,0","19,0","6,5","15,9","5,7","11,1","4,4","7,1","3,2","4,1","2,7","2,8",70,"POTENZA","E",183,2472,70,"POTENZA","PZ",48.8,null,null,70,"PZ","Potenza","28,7"]
[71,"PO","Prato","61",5.6,6.9,10.4,14.3,18,22.3,25,24.7,21.6,16.100000000000001,10.9,6.8,null,71,"PO","Prato","61","2","1,4","NE",null,71,"PO","Prato","61","43","52","11","05",0,null,71,"PO","Prato","2,6","2,5","3,7","4,1","5,2","6,3","6,8","8,8","7,9","11,0","8,3","12,7","7,5","16,2","6,8","13,4","5,5","9,","4,1","6,2","2,8","2,9","2,3","2,1",71,"PRATO","D",166,1668,71,"PRATO","PO",28.3,null,null,71,"PO","Prato","32,5"]
[72,"RG","Ragusa","502",8.6,9.1999999999999993,11.2,14.1,18.5,23.6,26.6,26.4,23.2,18.399999999999999,14.3,10.1,null,72,"RG","Ragusa","502","3","2,1","W",null,72,"RG","Ragusa","502","36","55","14","43",0,null,72,"RG","Ragusa","3,4","5,6","4,4","7,5","5,5","11,6","6,5","15,0","7,0","18,4","7,4","19,1","6,9","19,8","6,0","18,8","5,2","14,8","4,1","11,1","3,3","7,6","3,2","4,4",72,"RAGUSA","C",137,1324,72,"RAGUSA","RG",59.8,null,null,72,"RG","Ragusa","34,1"]
[73,"RA","Ravenna","4",1.9,3.4,8.1,12.4,16.399999999999999,20.9,23.4,22.9,19.7,14.3,8.9,3.8,null,73,"RA","Ravenna","4","2","2,1","E",null,73,"RA","Ravenna","4","44","25","12","11",-5,null,73,"RA","Ravenna","2,5","1,9","3,6","3,5","5,1","7,5","6,6","11,1","7,8","13,1","8,0","15,9","7,2","18,1","6,6","14,4",5.4,"10,1","4,0","5,5","2,7","2,4","2,1","1,5",73,"RAVENNA","E",183,2227,73,"RAVENNA","RA",37,null,null,73,"RA","Ravenna","31,0"]
[74,"RC","Reggio di Calabria","15",11.1,11.5,12.8,15.3,18.7,23,25.7,26.1,23.8,20,16.5,12.7,null,74,"RC","Reggio di Calabria","15","3","2,8","N",null,74,"RC","Reggio di Calabria","15","38","06","15","38",3,null,74,"RC","Reggio di Calabria","3,3","4,2","4,2","7,2","5,7","9,0","6,6","14,0","7,1","17,6","6,8","21,1","6,4","21,1","5,8","19,1","5,4","13,7","4,5","8,3","3,5","5,5","3,0","3,8",74,"REGGIO di CALABRIA","B",121,772,74,"REGGIO CALABRIA","RC",59.8,null,null,74,"RC","Reggio di Clabria","34,0"]
[75,"RE","Reggio nell'Emilia","58",1.1000000000000001,3.2,8.1999999999999993,12.7,16.899999999999999,21.2,23.8,22.9,19.600000000000001,13.3,7.2,2.8,null,75,"RE","Reggio nell'Emilia","58","1","1,1","E",null,75,"RE","Reggio nell'Emilia","58","44","41","10","37",-5,null,75,"RE","Reggio nell'Emilia","2,5","1,9","3,6","3,6","5,1","7,1","6,6","10,9","7,6","14,0","7,9","16,4","7,1","18,3","6,7","14,1","5,4","10,3","4,0","6,0","2,7","2,6","2,2","1,8",75,"REGGIO nell'EMILIA","E",183,2560,75,"REGGIO EMILIA","RE",37,null,null,75,"RE","Reggio nell'Emilia","31,5"]
[76,"RI","Rieti",405,3.7,4.9000000000000004,8.1,11.6,15.2,18.8,21.8,21.7,18.899999999999999,13.5,8.6999999999999993,5.0999999999999996,null,76,"RI","Rieti",405,"2","2,7","W",null,76,"RI","Rieti",405,"42","24","12","52",-3,null,76,"RI","Rieti","2,8","3,2","3,8","4,5","5,3","6,5","6,9","7,6","8,0","11,4","8,4","12,3","7,7","15,6","7,0","12,8","5,7","9,9","4,2","6,4","3,0","3,3","2,5","2,5",76,"RIETI","E",183,2324,76,"RIETI","RI",39.799999999999997,null,null,76,"RI","Rieti","29,5"]
[77,"RN","Rimini",5,3.1,4.9000000000000004,8.5,12.4,16.5,20.8,23.4,22.7,19.899999999999999,15,9.6,5.3,null,77,"RN","Rimini",5,"2","2,3","NW",null,77,"RN","Rimini",5,"44","03","12","34",-5,null,77,"RN","Rimini","2,5","2,1","3,6","4,2","5,1","7,6","6,7","10,2","7,6","14,1","7,9","16,3","7,0","18,7","6,4","15,5","5,3","10,9","4,0","6,3","2,8","2,9","2,2","1,9",77,"RIMINI","E",183,2139,77,"RIMINI","RN",37,null,null,77,"RN","Rimini","30,0"]
[78,"RM","Roma",20,7.6,8.6999999999999993,11.4,14.7,18.5,22.9,25.7,25.3,22.4,17.399999999999999,12.6,8.9,null,78,"RM","Roma",20,"2","2,6","SW",null,78,"RM","Roma",20,"41","53","12","28",0,null,78,"RM","Roma","2,9","3,4","3,9","5,3","5,3","8,4","6,7","12,2","7,3","16,3","7,5","18,2","6,6","20,5","6,2","17,1","5,3","12,3","4,1","8,1","3,1","4,2","2,6","2,8",78,"ROMA","D",166,1415,78,"ROMA","RM",39.799999999999997,null,null,78,"RM","Roma","33,8"]
[79,"RO","Rovigo",7,1.3,3.6,8.5,13.4,17.600000000000001,22,24.5,23.8,20.100000000000001,14,8.1,3.1,null,79,"RO","Rovigo",7,"1","1,9","NE",null,79,"RO","Rovigo",7,"45","04","11","47",-5,null,79,"RO","Rovigo","2,3","1,6","3,5","3,9","5,1","6,9","6,7","9,6","7,6","14,0","7,7","17,3","6,9","19,0","6,3","15,7","5,4","9,7","4,0","5,1","2,6","2,2","2,1","1,8",79,"ROVIGO","E",183,2466,79,"ROVIGO","RO",38.9,null,null,79,"RO","Rovigo","31,5"]
[80,"SA","Salerno",4,10.4,11.3,13.5,16.5,20.100000000000001,23.9,26.5,26.6,24.1,19.899999999999999,15.7,12.2,null,80,"SA","Salerno",4,"3","1,8","SW",null,80,"SA","Salerno",4,"40","40","14","46",2,null,80,"SA","Salerno","3,0","3,0","4,0","4,2","5,5","6,4","7,0","8,7","8,0","11,7","8,2","14,6","7,6","16,2","6,9","13,8","5,9","9,6","4,4","6,7","3,2","3,7","2,7","2,6",80,"SALERNO","C",137,994,80,"SALERNO","SA",48.8,null,null,80,"SA","Salerno","31,2"]
[81,"SS","Sassari",225,8.6999999999999993,9.1,11.3,14,16.8,21.4,24,24.5,22.1,17.5,13.5,9.9,null,81,"SS","Sassari",225,"4","3,1","W",null,81,"SS","Sassari",225,"40","43","8","33",2,null,81,"SS","Sassari","3,0","3,8","4,0","5,8","5,4","8,8","6,7","12,3","7,2","16,9","7,2","19,4","6,1","22,0","6,0","18,0","5,1","13,5","4,1","8,5","3,2","4,3","2,7","3,1",81,"SASSARI","C",137,1185,81,"SASSARI","SS",59.5,null,null,81,"SS","Sassari","30,5"]
[82,"SV","Savona",4,6.6,8.5,11.4,14.6,18.100000000000001,22.2,24.9,24.6,21.9,16.899999999999999,11.9,8.1999999999999993,null,82,"SV","Savona",4,"3","2,2","E",null,82,"SV","Savona",4,"44","18","8","18",0,null,82,"SV","Savona","2,6","2,9","3,6","4,7","5,1","7,4","6,7","9,9","7,9","11,7","8,4","12,8","7,6","16,1","6,9","12,5","5,5","9,6","4,0","6,3","2,8","3,4","2,3","2,7",82,"SAVONA","D",166,1481,82,"SAVONA","SV",63.2,null,null,82,"SV","Savona","29,1"]
[83,"SI","Siena",322,4.8,5.7,9.1,12.4,16.3,21,24,23.7,20.2,14.6,9.8000000000000007,6,null,83,"SI","Siena",322,"2","2,0","NW",null,83,"SI","Siena",322,"43","19","11","19",-2,null,83,"SI","Siena","2,7","2,7","3,7","4,2","5,2","6,5","6,8","9,2","7,8","12,6","8,0","15,2","7,4","17,0","6,7","13,7","5,5","10,0","4,1","6,0","2,9","3,1","2,3","2,0",83,"SIENA","D",166,1943,83,"SIENA","SI",28.3,null,null,83,"SI","Siena","31,3"]
[84,"SR","Siracusa",17,11.3,11.5,13.1,15.4,18.7,23,26.2,26.4,23.9,20.100000000000001,16.399999999999999,12.9,null,84,"SR","Siracusa",17,"3","5,2","W",null,84,"SR","Siracusa",17,"37","04","15","17",5,null,84,"SR","Siracusa","3,4","5,5","4,3","7,8","5,4","11,6","6,4","15,4","6,7","19,3","6,8","20,9","6,3","21,6","5,5","20,2","5,1","15,3","4,2","10,8","3,4","7,2","3,1","4,7",84,"SIRACUSA","B",121,799,84,"SIRACUSA","SR",59.8,null,null,84,"SR","Siracusa","33,1"]
[85,"SO","Sondrio",307,0.5,3.3,8.1999999999999993,12.6,16,20,22.3,21.4,18.100000000000001,12.4,6.6,1.7,null,85,"SO","Sondrio",307,"1","0,8","E",null,85,"SO","Sondrio",307,"46","10","9","52",-10,null,85,"SO","Sondrio","2,3","3,2","3,2","5,7","4,6","9,6","6,4","11,4","7,6","13,8","8,2","14,4","7,8","14,6","6,7","13,4","5,1","10,8","3,7","6,4","2,5","4,2","2,0","2,7",85,"SONDRIO","E",183,2755,85,"SONDRIO","SO",38.700000000000003,null,null,85,"SO","Sondrio","29,9"]
[86,"TA","Taranto",15,9.1999999999999993,9.6999999999999993,11.3,14.5,18.5,23,25.9,25.8,23,18.7,14.4,10.9,null,86,"TA","Taranto",15,"2","5,1","N",null,86,"TA","Taranto",15,"40","27","17","14",0,null,86,"TA","Taranto","3,0","3,8","4,0","5,9","5,4","8,8","6,6","12,9","7,3","16,5","7,0","20,2","6,1","22,0","5,9","18,3","5,3","13,0","4,2","8,4","3,2","4,7","2,7","3,3",86,"TARANTO","C",137,1071,86,"TARANTO","TA",41.7,null,null,86,"TA","Taranto","33,0"]
[87,"TE","Teramo",265,5.0999999999999996,5.9,9,12.8,16.8,21.4,24,23.6,20.399999999999999,15.1,10.4,6.6,null,87,"TE","Teramo",265,"1","1,3","SW",null,87,"TE","Teramo",265,"42","39","13","42",0,null,87,"TE","Teramo","2,8","2,8","3,8","4,6","5,3","7,2","6,8","10,7","7,7","13,6","8,0","15,6","7,1","18,6","6,3","16,2","5,6","10,4","4,2","6,6","3,0","3,6","2,5","2,5",87,"TERAMO","D",166,1834,87,"TERAMO","TE",39.799999999999997,null,null,87,"TE","Teramo","33,0"]
[88,"TR","Terni",130,6.7,7.6,10.7,13.6,17.600000000000001,22.3,24.7,24.3,21.1,16.399999999999999,11.3,6.6,null,88,"TR","Terni",130,"2","2,7","W",null,88,"TR","Terni",130,"42","33","12","38",-2,null,88,"TR","Terni","2,8","2,9","3,8","4,3","5,3","7,2","6,9","8,4","7,9","12,0","8,3","13,5","7,6","16,4","6,8","13,9","5,6","10,6","4,2","6,6","3,0","3,6","2,4","2,3",88,"TERNI","D",166,1650,88,"TERNI","TR",39.799999999999997,null,null,88,"TR","Terni","32,8"]
[89,"TO","Torino",239,0.4,3.2,8.1999999999999993,12.7,16.7,21.1,23.3,22.6,18.8,12.6,6.8,2,null,89,"TO","Torino",239,"1","0,8","NE",null,89,"TO","Torino",239,"45","07","7","43",-8,null,89,"TO","Torino","2,5","2,5","3,5","4,3","5,0","7,2","6,6","10,4","7,9","11,7","8,3","13,2","7,6","15,9","7,0","11,5","5,6","7,9","4,0","5,3","2,7","2,8","2,1","2,6",89,"TORINO","E",183,2617,89,"TORINO","TO",44.4,null,null,89,"TO","Torino","30,7"]
[90,"TP","Trapani",3,11,11.5,13.2,15.8,19.2,23.3,25.8,26.2,24,19.899999999999999,15.8,12.4,null,90,"TP","Trapani",3,"3","6,8","NW",null,90,"TP","Trapani",3,"38","01","12","32",5,null,90,"TP","Trapani","3,3","5,2","4,2","7,2","5,4","11,0","6,4","15,1","6,5","20,0","6,4","22,3","5,8","23,1","5,1","21,2","5,0","15,5","4,2","10,3","3,4","6,5","3,0","4,4",90,"TRAPANI","B",121,810,90,"TRAPANI","TP",59.8,null,null,90,"TP","Trapani","31,6"]
[91,"TN","Trento",194,4.3,7.3,11.8,16.5,20,24,26.3,25.5,22.3,16.399999999999999,10.199999999999999,5.7,null,91,"TN","Trento",194,"1","1,1","N",null,91,"TN","Trento",194,"46","03","11","07",-12,null,91,"TN","Trento","2,3","2,6","3,4","5,0","4,7","9,0","6,5","11,2","7,7","13,2","8,1","15,1","7,3","17,3","6,7","13,5","5,2","10,3","3,8","5,6","2,6","2,9","2,0","2,1",91,"TRENTO","E",183,2567,91,"TRENTO","TN",38.9,null,null,91,"TN","Trento","31,6"]
[92,"TV","Treviso",15,2.8,4.4000000000000004,8.4,13.2,17.100000000000001,21.6,23.8,23.2,19.8,14,8.1999999999999993,4.3,null,92,"TV","Treviso",15,"2","1,0","NE",null,92,"TV","Treviso",15,"45","40","12","14",-5,null,92,"TV","Treviso","2,3","2,2","3,4","4,5","5,0","7,1","6,7","9,2","7,8","12,5","7,9","15,8","7,2","17,3","6,5","14,6","5,4","9,8","3,9","5,7","2,5","2,3","2,0","1,9",92,"TREVISO","E",183,2378,92,"TREVISO","TV",51.8,null,null,92,"TV","Treviso","31,0"]
[93,"TS","Trieste",2,4.9000000000000004,6.2,9.4,13.5,17.7,21.9,24.2,24,20.7,15.5,10.6,6.9,null,93,"TS","Trieste",2,"3","2,6","E",null,93,"TS","Trieste",2,"45","39","13","47",-5,null,93,"TS","Trieste","2,4","1,9","3,5","3,7","5,0","6,1","6,7","8,9","7,8","12,2","8,4","13,1","7,7","15,6","6,7","13,3","5,4","9,4","3,9","5,7","2,6","2,5","2,1","1,8",93,"TRIESTE","D",166,1929,93,"TRIESTE","TS",57.5,null,null,93,"TS","Trieste","31,1"]
[94,"UD","Udine",113,3.5,5,8.6,13.3,17.3,21.1,23.3,23.1,19.8,14.2,8.6999999999999993,4.8,null,94,"UD","Udine",113,"1","1,7","NE",null,94,"UD","Udine",113,"46","03","13","14",-5,null,94,"UD","Udine","2,3","2,1","3,4","3,6","5,0","5,9","6,7","8,6",7.9,"11,1","8,4","11,8","7,9","14,1","6,9","12,0","5,5","8,6","3,8","5,6","2,6","2,4","2,0","2,0",94,"UDINE","E",183,2323,94,"UDINE","UD",57.5,null,null,94,"UD","Udine","31,4"]
[95,"VA","Varese",382,1.2,1.9,6,10.4,14,17.7,20.5,19.600000000000001,16.399999999999999,11.2,5.3,1.9,null,95,"VA","Varese",382,"1","1,3","N",null,95,"VA","Varese",382,"45","49","8","49",-5,null,95,"VA","Varese","2,4","2,6","3,4","3,9","5,0","6,4","6,7","8,7","7,9","11,2","8,4","12,1","8,0","14,0","7,0","11,2","5,5","8,2","3,9","5,1","2,6","3,0","2,1","2,6",95,"VARESE","E",183,2652,95,"VARESE","VA",38.700000000000003,null,null,95,"VA","Varese","29,0"]
[96,"VE","Venezia",1,3.3,4.8,8.6,13.2,17.3,21.3,23.6,23.4,20.399999999999999,14.9,9.5,5,null,96,"VE","Venezia",1,"3","2,6","NE",null,96,"VE","Venezia",1,"45","26","12","20",-5,null,96,"VE","Venezia",2.4,"2,1","3,5","4,6","5,0","7,5","6,6","10,3","7,6","14,3","7,5","18,3","6,4","20,7","6,2","15,9","5,3","10,5","3,9","5,9","2,6","2,7","2,1","2,0",96,"VENEZIA","E",183,2345,96,"VENEZIA","VE",51.8,null,null,96,"VE","Venezia","31,0"]
[97,"VB","Verbania",197,2.9,4.5999999999999996,8.5,12.6,16.600000000000001,20.8,23.3,22.6,19.3,13.5,8.1,4.2,null,97,"VB","Verbania",197,"1","0,9","S",null,97,"VB","Verbania",197,"45","55","8","33",-5,null,97,"VB","Verbania","2,4","2,8","3,4","4,0","5,0","6,4","6,6","10,3","7,9","10,3","8,2","13,8","7,7","15,5","7,0","11,3","5,4","8,9","3,9","5,2","2,6","3,3","2,1","2,6",97,"VERBANIA","E",183,2426,97,"VERBANIA","VB",44.4,null,null,97,"VB","Verbania","30,0"]
[98,"VC","Vercelli",130,0.2,2.9,7.7,12.5,17.2,21.7,23.8,22.8,18.7,12.7,6.5,1.8,null,98,"VC","Vercelli",130,"1","0,8","N",null,98,"VC","Vercelli",130,"45","19","8","25",-7,null,98,"VC","Vercelli","2,4","1,8","3,5","3,6","5,1","6,7","6,6","10,1","7,8","12,3","8,3","13,6","7,4","17,0","6,8","12,8","5,5","8,6","4,0","4,4","2,6","2,2","2,0","1,5",98,"VERCELLI","E",183,2751,98,"VERCELLI","VC",38.700000000000003,null,null,98,"VC","Vercelli","32,0"]
[99,"VR","Verona",59,2.4,4.9000000000000004,9.3000000000000007,13.7,17.399999999999999,21.7,23.8,23.6,20.2,14.7,8.5,4.3,null,99,"VR","Verona",59,"1","0,9","E",null,99,"VR","Verona",59,"45","26","10","59",-5,null,99,"VR","Verona","2,3","1,8","3,5","3,6","5,1","5,9","6,7","8,0","7,9","11,0","8,4","12,3","8,0","13,6","7,0","11,6","5,5","8,8","3,9","5,5","2,6","2,4","2,1","2,1",99,"VERONA","E",166,2468,99,"VERONA","VR",38.9,null,null,99,"VR","Verona","31,6"]
[100,"VI","Vicenza",39,2.4,4.2,8.5,12.9,17,21.3,23.6,23,19.600000000000001,13.9,8.5,4.0999999999999996,null,100,"VI","Vicenza",39,"1","1,3","E",null,100,"VI","Vicenza",39,"45","32","11","32",-5,null,100,"VI","Vicenza","2,3","2,3","3,4","4,0","5,0","6,8","6,6","8,7","7,8","11,6","8,3","13,1","7,9","14,2","6,8","12,7","5,4","9,3","3,8","5,5","2,5","2,9","2,0","2,4",100,"VICENZA","E",183,2371,100,"VICENZA","VI",38.9,null,null,100,"VI","Vicenza","32,6"]
[101,"VT","Viterbo",326,5.7,6.6,9.4,12.7,16.899999999999999,21.8,24.8,24,20.7,15.9,11.3,7.5,null,101,"VT","Viterbo",326,"2","4,0","NE",null,101,"VT","Viterbo",326,"42","25","12","06",-2,null,101,"VT","Viterbo","2,8","3,1","3,8","4,7","5,3","7,6","6,8","9,4","7,7","13,2","8,1","14,8",7.4,"17,4","6,6","14,7","5,5",11.2,"4,1","7,2","3,0","3,9","2,4","2,6",101,"VITERBO","D",166,1989,101,"VITERBO","VT",39.799999999999997,null,null,101,"VT","Viterbo","31,0"]

{"sheet":"cashflow","index":24,"n_rows":39,"n_cols":23,"rows_kept":39,"cut":false,"hidden":true,"merged":[]}
[]
[]
[]
[]
[]
[]
[]
[]
[]
[]
[]
[]
[]
[]
[]
[]
[]
[]
[null,null,"Anno",1,2,3,4,5,6,7,8,9,10]
[null,null,"Costi attualizz. (manutenzione)",{"$f":"manut*(1+tasso/100)^D19","v":0},0,0,0,0,0,0,0,0,0]
[null,null,"Risparmi  combust. (attualizz.)",{"$f":"+ammortamento!$C$18","v":204.85},{"$f":"$D$21*(1+tasso/100)^E19","v":221.56576000000001},230.42839040000001,239.64552601600005,249.23134705664006,259.20060093890567,269.56862497646188,280.35136997552041,291.56542477454121,303.2280417655229]
[null,null,"Risparmio netto R-C",{"$f":"D21-D20","v":204.85},221.56576000000001,230.42839040000001,239.64552601600005,249.23134705664006,259.20060093890567,269.56862497646188,280.35136997552041,291.56542477454121,303.2280417655229]
[]
[null,null,"Risparmio cumul.",{"$f":"D22","v":204.85},{"$f":"D24+E22","v":426.41575999999998},656.84415039999999,896.48967641600007,1145.7210234726401,1404.9216244115457,1674.4902493880077,1954.841619363528,2246.4070441380691,2549.635085903592]
[null,null,"Detrazioni",{"$f":"+incentivi!E35","v":393.95999999999992},{"$f":"+incentivi!E36","v":393.95999999999992},{"$f":"incentivi!E37","v":0},{"$f":"+incentivi!E38","v":0},{"$f":"+incentivi!E39","v":0},{"$f":"+incentivi!E40","v":0},{"$f":"+incentivi!E41","v":0},{"$f":"+incentivi!E42","v":0},{"$f":"+incentivi!E43","v":0},{"$f":"+incentivi!E44","v":0}]
[null,null,"Detrazioni cumul.",{"$f":"+D25","v":393.95999999999992},{"$f":"+D26+E25","v":787.91999999999985},787.91999999999985,787.91999999999985,787.91999999999985,787.91999999999985,787.91999999999985,787.91999999999985,787.91999999999985,787.91999999999985]
[]
[null,null,"Pay back",{"$f":"(-costo2)+D24+D26","v":-6401.19},-5785.6642400000001,-5555.2358495999997,-5315.5903235839996,-5066.35897652736,-4807.158375588454,-4537.5897506119927,-4257.2383806364724,-3965.6729558619309,-3662.444914096408,{"$f":"+D39","v":-3347.0877506602646},-3019.1163006866745,-2678.0259927141415,-2323.292072422707,-1954.3687953196152,-1570.6885871323996,-1171.6611706176957,-756.67265744240308,-325.08460374009906,123.76697211029727]
[]
[null,null,"Anno",11,12,13,14,15,16,17,18,19,20]
[null,null,"Costi attualizz. (manutenzione)",{"$f":"manut*(1+tasso/100)^D30","v":0},0,0,0,0,0,0,0,0,0]
[null,null,"Risparmi  combust. (attualizz.)",{"$f":"$D$21*(1+tasso/100)^D30","v":315.35716343614376},327.97144997358959,341.0903079725332,354.73392029143452,368.92327710309189,383.68020818721561,399.02741651470427,414.9885131752925,431.58805370230414,448.85157585039633]
[null,null,"Risparmio netto R-C",{"$f":"D32-D31","v":315.35716343614376},327.97144997358959,341.0903079725332,354.73392029143452,368.92327710309189,383.68020818721561,399.02741651470427,414.9885131752925,431.58805370230414,448.85157585039633]
[]
[null,null,"Risparmio cumul.",{"$f":"M24+D33","v":2864.9922493397357},{"$f":"D35+E33","v":3192.9636993133254},3534.0540072858585,3888.787927577293,4257.711204680385,4641.3914128676006,5040.4188293823045,5455.4073425575971,5886.9953962599011,6335.8469721102974]
[null,null,"Detrazioni"]
[null,null,"Detrazioni cumul.",{"$f":"+M26+D36","v":787.91999999999985},{"$f":"+D37+E36","v":787.91999999999985},787.91999999999985,787.91999999999985,787.91999999999985,787.91999999999985,787.91999999999985,787.91999999999985,787.91999999999985,787.91999999999985]
[]
[null,null,"Pay back",{"$f":"(-costo2)+D35+D37","v":-3347.0877506602646},-3019.1163006866745,-2678.0259927141415,-2323.292072422707,-1954.3687953196152,-1570.6885871323996,-1171.6611706176957,-756.67265744240308,-325.08460374009906,123.76697211029727]